{"text_format":"1","workbook":"xlsx","n_sheets":3,"sheets":["FRONT PAGE","CFR Return","Ind Schs Balances 18-19"],"not_rendered":{"charts":0,"images":1,"macros":1,"external_links":51,"defined_names":1402,"comments":0,"pivot_tables":0},"unopened":[],"bounds":{"document_bytes":16777216,"sheet_cells":100000,"rows_first":2000,"rows_last":500,"rows_between":2000,"halvings":0,"cell_chars":16384,"cell_head_chars":4096},"cells_cut":0,"cells_raw":0,"read":"whole","date_system":"1900"}

{"sheet":"FRONT PAGE","index":0,"n_rows":99,"n_cols":25,"rows_kept":99,"cut":false,"hidden":false,"merged":[[8,3,9,3],[8,5,9,5]]}
[null,null,null,null,null,null,null,null,null,null,null,null,null,null,null,null,null,null,null,null,null,null,null,"Choose your school"]
[null,null,null,null,null,null,null,null,null,null,null,null,null,null,null,null,null,null,null,null,null,null,null,"Akiva",3520]
[null,null,null,null,null,null,null,null,null,null,null,null,null,null,null,null,null,null,null,null,null,null,null,"All Saints' CE School (N20)",3317]
[null,null,null,null,null,null,null,null,null,null,null,null,null,null,null,null,null,null,null,null,null,null,null,"All Saints' CE School (NW2)",3300]
[null,null,null,null,null,null,null,null,null,null,null,null,null,null,null,null,null,null,null,null,null,null,null,"Annunciation RC Infant School",3500]
[null,null,null,null,null,null,null,null,null,null,null,null,null,null,null,null,null,null,null,null,null,null,null,"Annunciation RC Junior School",3514]
[null,null,null,"2018-19 CFR RETURN",null,null,null,null,null,null,null,null,null,null,null,null,null,null,null,null,null,null,null,"Barnfield School",2002]
[null,null,null,null,null,null,null,null,null,null,null,null,null,null,null,null,null,null,null,null,null,null,null,"Beis Yaakov",2079]
[null,null,null,"Choose your school",null,{"$f":"VLOOKUP(D9,X:Y,2,0)","v":0},null,null,null,null,null,null,null,null,null,null,null,null,null,null,null,null,null,"Beit Shvidler",3524]
[null,null,null,null,null,null,null,null,null,null,null,null,null,null,null,null,null,null,null,null,null,null,null,"Bell Lane School",2003]
[null,null,null,null,null,null,null,null,null,null,null,null,null,null,null,null,null,null,null,null,null,null,null,"Blessed Dominic RC School",3511]
[null,null,null,null,null,null,null,null,null,null,null,null,null,null,null,null,null,null,null,null,null,null,null,"Brookhill Nursery",1000]
[null,null,null,null,null,null,null,null,null,null,null,null,null,null,null,null,null,null,null,null,null,null,null,"Brookland Infant School",2008]
[null,null,null,null,null,null,null,null,null,null,null,null,null,null,null,null,null,null,null,null,null,null,null,"Brookland Junior School",2007]
[null,null,null,null,null,null,null,null,null,null,null,null,null,null,null,null,null,null,null,null,null,null,null,"Brunswick Park School",2009]
[null,null,null,null,null,null,null,null,null,null,null,null,null,null,null,null,null,null,null,null,null,null,null,"Chalgrove School",2067]
[null,null,null,null,null,null,null,null,null,null,null,null,null,null,null,null,null,null,null,null,null,null,null,"Childs Hill School",2010]
[null,null,null,null,null,null,null,null,null,null,null,null,null,null,null,null,null,null,null,null,null,null,null,"Christ Church CE School",3302]
[null,null,null,null,null,null,null,null,null,null,null,null,null,null,null,null,null,null,null,null,null,null,null,"Church Hill School",2011]
[null,null,null,null,null,null,null,null,null,null,null,null,null,null,null,null,null,null,null,null,null,null,null,"Colindale School",2014]
[null,null,null,null,null,null,null,null,null,null,null,null,null,null,null,null,null,null,null,null,null,null,null,"Coppetts Wood School",2015]
[null,null,null,null,null,null,null,null,null,null,null,null,null,null,null,null,null,null,null,null,null,null,null,"Courtland School",2016]
[null,null,null,null,null,null,null,null,null,null,null,null,null,null,null,null,null,null,null,null,null,null,null,"Cromer Road School",2017]
[null,null,null,null,null,null,null,null,null,null,null,null,null,null,null,null,null,null,null,null,null,null,null,"Danegrove School",2073]
[null,null,null,null,null,null,null,null,null,null,null,null,null,null,null,null,null,null,null,null,null,null,null,"Deansbrook Infant School",2019]
[null,null,null,null,null,null,null,null,null,null,null,null,null,null,null,null,null,null,null,null,null,null,null,"Dollis Infant School",2021]
[null,null,null,"Contacts;",null,null,null,null,null,null,null,null,null,null,null,null,null,null,null,null,null,null,null,"Dollis Junior School",5200]
[null,null,null,"Claudette James 0208 359 7132",null,null,null,null,null,null,null,null,null,null,null,null,null,null,null,null,null,null,null,"Edgware Primary",2023]
[null,null,null,"Nicole Gibson      0208 359 7223 Tues/Weds/Thurs",null,null,null,null,null,null,null,null,null,null,null,null,null,null,null,null,null,null,null,"Fairway School",2024]
[null,null,null,null,null,null,null,null,null,null,null,null,null,null,null,null,null,null,null,null,null,null,null,"Finchley Catholic High School",5405]
[null,null,null,null,null,null,null,null,null,null,null,null,null,null,null,null,null,null,null,null,null,null,null,"Foulds School",2025]
[null,null,null,null,null,null,null,null,null,null,null,null,null,null,null,null,null,null,null,null,null,null,null,"Friern Barnet School",4003]
[null,null,null,null,null,null,null,null,null,null,null,null,null,null,null,null,null,null,null,null,null,null,null,"Frith Manor School",2026]
[null,null,null,null,null,null,null,null,null,null,null,null,null,null,null,null,null,null,null,null,null,null,null,"Garden Suburb Infant School",2028]
[null,null,null,null,null,null,null,null,null,null,null,null,null,null,null,null,null,null,null,null,null,null,null,"Garden Suburb Junior School",2027]
[null,null,null,null,null,null,null,null,null,null,null,null,null,null,null,null,null,null,null,null,null,null,null,"Goldbeaters School",2029]
[null,null,null,null,null,null,null,null,null,null,null,null,null,null,null,null,null,null,null,null,null,null,null,"Hampden Way Nursery",1001]
[null,null,null,null,null,null,null,null,null,null,null,null,null,null,null,null,null,null,null,null,null,null,null,"Hasmonean Primary School",3516]
[null,null,null,null,null,null,null,null,null,null,null,null,null,null,null,null,null,null,null,null,null,null,null,"Hollickwood School",2031]
[null,null,null,null,null,null,null,null,null,null,null,null,null,null,null,null,null,null,null,null,null,null,null,"Holly Park School",2032]
{"$rows_left_out":60}
{"sheet":"CFR Return","index":1,"n_rows":175,"n_cols":5,"rows_kept":175,"cut":false,"hidden":false,"merged":[[41,1,41,2],[56,0,57,2],[34,1,34,2],[35,1,35,2],[36,1,36,2],[37,1,37,2],[38,1,38,2],[39,1,39,2],[33,1,33,2],[5,0,5,2],[27,1,27,2],[28,1,28,2],[29,1,29,2],[32,1,32,2]]}
[]
[]
[null,"School DfE No.",{"$f":"'FRONT PAGE'!$F$9","v":0}," ",{"$f":"'FRONT PAGE'!$F$9","v":0}]
[]
[]
["CFR Return - Division of Total Revenue and Capital Balances as at 31 March 2019"]
[]
[null,"School","Cost Centre"]
[null,{"$f":"VLOOKUP($C$3,$A$71:$C$175,2,0)","v":{"$error":"#N/A"}},{"$f":"VLOOKUP($C$3,$A$71:$C$175,3,0)","v":{"$error":"#N/A"}}]
[]
["CFR Heading","Description","Balance as at 31.03.19"]
[null,null,"£"]
["B01","Committed Revenue Balance"]
["B02","Uncommitted Revenue Balance"]
["B06","Community Focussed Extended Schl Bal"]
[null,"Total Revenue Balance",{"$f":"VLOOKUP($C$9,'Ind Schs Balances 18-19'!$A$8:$J$113,3,0)","v":{"$error":"#N/A"}}]
[]
["B03","Devolved Formula Capital Balance"]
["B05","Other Capital Balances"]
[]
[null,"Total Capital Balance",{"$f":"VLOOKUP($C$9,'Ind Schs Balances 18-19'!$A$8:$J$113,8,0)","v":{"$error":"#N/A"}}]
[]
[]
["Please enter figures to show the breakdown of your total revenue and total"]
["capital balance as at 31 March 2019"]
[]
[]
["B01","Committed Revenue Balances - This includes: "]
[null,"Committed cumulative balance of income, less expenditure from revenue funding sources during the financial year and any committed revenue balances from previous years - this includes revenue funding received during previous financial years from specific grants "]
[null,"Any unspent voluntary income"]
[null,"Any unspent and committed pupil-focused extended school funding and/or grants"]
[null,"Unspent amount of current financial year's Pupil Premium grant"]
["B02","Uncommitted Revenue Balance - Any revenue balances including "]
[null,"the previous years not committed - Not including  any balances from "]
[null,"B01 or B06"]
["B06","Community Focussed Sch Balance - Any unspent "]
[null,"community focussed school balances (I16 & I17 less E31 &"]
[null,"E32)"]
["B03","Devolved Formula Capital Balance - Any Devolved"]
[null,"Formula Capital funding not spent"]
{"$rows_left_out":136}
{"sheet":"Ind Schs Balances 18-19","index":2,"n_rows":115,"n_cols":16,"rows_kept":115,"cut":false,"hidden":false,"merged":[[1,1,1,13],[2,2,2,5],[2,7,2,9],[2,11,2,13],[2,14,2,15]]}
[1,2,3,4,5,6,7,8,9,10,11,12,13,14,15,16]
[null,"Final Individual School Outturn Balances 2018-19"]
[null,null,"Revenue",null,null,null,null,"Capital",null,null,null,"Total Balance",null,null,"Revenue Balance as % of Total Income"]
[null,"School","As at 31.03.19","As at 31.03.18","Balance as % Final Budget Share 14-15","Increase / (decrease)",null,"As at 31.03.19","As at 31.03.18","Increase / (decrease)",null,"As at 31.03.19","As at 31.03.18","Increase / (decrease)","School income 2018-19*","% Outturn against Income"]
[10130,"Brookhill",{"$f":"VLOOKUP(A5,'[50]balances from P12 EOY'!$B$6:$X$103,20,0)","v":{"$error":"#N/A"}},{"$f":"[51]Brk!$H$66","v":156379.92000000001},0,{"$f":"C5-D5","v":{"$error":"#N/A"}},null,{"$f":"VLOOKUP(A5,'[50]balances from P12 EOY'!$B$6:$X$103,22,0)","v":0},{"$f":"[51]Brk!$H$76","v":4720.55},{"$f":"H5-I5","v":-4720.55},null,{"$f":"C5+H5","v":{"$error":"#N/A"}},161100.47,{"$f":"L5-M5","v":{"$error":"#N/A"}},{"$f":"VLOOKUP(A5,'[50]FUNDING ONLY'!$A$8:$J$98,10,0)","v":{"$error":"#N/A"}},{"$f":"L5/O5","v":{"$error":"#N/A"}}]
[10131,"Hampden Way",{"$f":"VLOOKUP(A6,'[50]balances from P12 EOY'!$B$6:$X$103,20,0)","v":{"$error":"#N/A"}},{"$f":"[51]Hmp!$H$70","v":168833.62},0,{"$f":"C6-D6","v":{"$error":"#N/A"}},null,{"$f":"VLOOKUP(A6,'[50]balances from P12 EOY'!$B$6:$X$103,22,0)","v":0},{"$f":"[51]Hmp!$H$81","v":3841.38},{"$f":"H6-I6","v":-3841.38},null,{"$error":"#N/A"},172675,{"$f":"L6-M6","v":{"$error":"#N/A"}},{"$f":"VLOOKUP(A6,'[50]FUNDING ONLY'!$A$8:$J$98,10,0)","v":{"$error":"#N/A"}},{"$f":"L6/O6","v":{"$error":"#N/A"}}]
[10133,"St Margarets",{"$f":"VLOOKUP(A7,'[50]balances from P12 EOY'!$B$6:$X$103,20,0)","v":{"$error":"#N/A"}},{"$f":"[51]StM!$H$67","v":14131.35},0,{"$f":"C7-D7","v":{"$error":"#N/A"}},null,{"$f":"VLOOKUP(A7,'[50]balances from P12 EOY'!$B$6:$X$103,22,0)","v":0},{"$f":"[51]StM!$H$79","v":5855.55},{"$f":"H7-I7","v":-5855.55},null,{"$error":"#N/A"},19986.900000000001,{"$f":"L7-M7","v":{"$error":"#N/A"}},{"$f":"VLOOKUP(A7,'[50]FUNDING ONLY'!$A$8:$J$98,10,0)","v":{"$error":"#N/A"}},{"$f":"L7/O7","v":{"$error":"#N/A"}}]
[10135,"BEYA",{"$f":"VLOOKUP(A8,'[50]balances from P12 EOY'!$B$6:$X$103,20,0)","v":419513.49},{"$f":"SUM(D5:D7)","v":339344.89},0,{"$f":"C8-D8","v":80168.599999999977},null,{"$f":"VLOOKUP(A8,'[50]balances from P12 EOY'!$B$6:$X$103,22,0)","v":58866.55},{"$f":"SUM(I5:I7)","v":14417.48},{"$f":"H8-I8","v":44449.070000000007},null,478380.04,353762.37,{"$f":"L8-M8","v":124617.66999999998},{"$f":"VLOOKUP(A8,'[50]CFR ANALYSIS REVENUE INCOME '!$A$4:$S$97,19,0)","v":2331715.52},{"$f":"C8/O8","v":0.17991624038253173}]
[10132,"Moss Hall Nursery",{"$f":"VLOOKUP(A9,'[50]balances from P12 EOY'!$B$6:$X$103,20,0)","v":228364.28},{"$f":"[51]MHN!$H$70","v":304596.52},0,{"$f":"C9-D9","v":-76232.24000000002},null,{"$f":"VLOOKUP(A9,'[50]balances from P12 EOY'!$B$6:$X$103,22,0)","v":17589.919999999998},{"$f":"[51]MHN!$H$81","v":9136.26},{"$f":"H9-I9","v":8453.659999999998},null,245954.2,313732.78000000003,{"$f":"L9-M9","v":-67778.580000000016},{"$f":"VLOOKUP(A9,'[50]CFR ANALYSIS REVENUE INCOME '!$A$4:$S$97,19,0)","v":610971.97000000009},{"$f":"C9/O9","v":0.37377210610823924}]
[]
[null,"Sub Total - Nursery Sector",{"$f":"SUM(C8:C9)","v":647877.77},{"$f":"SUM(D8:D9)","v":643941.41},{"$f":"SUM(E8:E9)","v":0},{"$f":"SUM(F8:F9)","v":3936.3599999999569},null,{"$f":"SUM(H8:H9)","v":76456.47},{"$f":"SUM(I8:I9)","v":23553.739999999998},52902.73,0,724334.24,667495.15,56839.089999999967,2942687.49,{"$f":"C11/O11","v":0.22016533260893428}]
[]
[11094,"Akiva",{"$f":"VLOOKUP(A13,'[50]balances from P12 EOY'!$B$6:$X$103,20,0)","v":114819.83000000006},{"$f":"[51]Akv!$H$72","v":37544.599999999984},0,{"$f":"C13-D13","v":77275.230000000069},null,{"$f":"VLOOKUP(A13,'[50]balances from P12 EOY'!$B$6:$X$103,22,0)","v":0},0,{"$f":"H13-I13","v":0},null,{"$f":"C13+H13","v":114819.83000000006},37544.599999999984,{"$f":"L13-M13","v":77275.230000000069},{"$f":"VLOOKUP(A13,'[50]CFR ANALYSIS REVENUE INCOME '!$A$4:$S$97,19,0)","v":2572927.9700000002},{"$f":"C13/O13","v":4.462613463679671E-2}]
[10042,"All Saints' CE School (N20)",{"$f":"VLOOKUP(A14,'[50]balances from P12 EOY'!$B$6:$X$103,20,0)","v":89708.579999999929},{"$f":"[51]AstN20!$H$72","v":123256.73},0,-33548.150000000067,null,{"$f":"VLOOKUP(A14,'[50]balances from P12 EOY'!$B$6:$X$103,22,0)","v":0},{"$f":"[51]AstN20!$H$83","v":0},0,null,89708.579999999929,123256.73,-33548.150000000067,{"$f":"VLOOKUP(A14,'[50]CFR ANALYSIS REVENUE INCOME '!$A$4:$S$97,19,0)","v":1484838.0099999998},{"$f":"C14/O14","v":6.0416408655917922E-2}]
[10040,"All Saints' CE School (NW2)",{"$f":"VLOOKUP(A15,'[50]balances from P12 EOY'!$B$6:$X$103,20,0)","v":31136.47},{"$f":"[51]AstNW2!$H$71","v":106584.36},0,-75447.89,null,{"$f":"VLOOKUP(A15,'[50]balances from P12 EOY'!$B$6:$X$103,22,0)","v":0},{"$f":"[51]AstNW2!$H$81","v":0},0,null,31136.47,106584.36,-75447.89,{"$f":"VLOOKUP(A15,'[50]CFR ANALYSIS REVENUE INCOME '!$A$4:$S$97,19,0)","v":1148436.6499999997},2.7112048365924242E-2]
[10043,"Annunciation RC Infant School",{"$f":"VLOOKUP(A16,'[50]balances from P12 EOY'!$B$6:$X$103,20,0)","v":211077.57},{"$f":"[51]AnnI!$H$65","v":175894.23},0,35183.339999999997,null,{"$f":"VLOOKUP(A16,'[50]balances from P12 EOY'!$B$6:$X$103,22,0)","v":0},0,0,null,211077.57,175894.23,35183.339999999997,{"$f":"VLOOKUP(A16,'[50]CFR ANALYSIS REVENUE INCOME '!$A$4:$S$97,19,0)","v":1094971.8600000001},0.19276985803087213]
[10117,"Annunciation RC Junior School",{"$f":"VLOOKUP(A17,'[50]balances from P12 EOY'!$B$6:$X$103,20,0)","v":170575.05},{"$f":"[51]AnnJ!$H$70","v":103114.32},0,67460.729999999981,null,{"$f":"VLOOKUP(A17,'[50]balances from P12 EOY'!$B$6:$X$103,22,0)","v":0},0,0,null,170575.05,103114.32,67460.729999999981,{"$f":"VLOOKUP(A17,'[50]CFR ANALYSIS REVENUE INCOME '!$A$4:$S$97,19,0)","v":1154991.25},0.14768514480088052]
[10044,"Barnfield School",{"$f":"VLOOKUP(A18,'[50]balances from P12 EOY'!$B$6:$X$103,20,0)","v":393539.07000000007},{"$f":"[51]Barnf!$H$75","v":411190.28000000014},0,-17651.210000000079,null,{"$f":"VLOOKUP(A18,'[50]balances from P12 EOY'!$B$6:$X$103,22,0)","v":9306.17},{"$f":"[51]Barnf!$H$87","v":-1.0900000000000001},9307.26,null,402845.24000000005,411189.19000000012,-8343.9500000000698,{"$f":"VLOOKUP(A18,'[50]CFR ANALYSIS REVENUE INCOME '!$A$4:$S$97,19,0)","v":3063175.6100000003},0.12847421111452373]
[10128,"Beis Yaakov",{"$f":"VLOOKUP(A19,'[50]balances from P12 EOY'!$B$6:$X$103,20,0)","v":112118.68999999999},{"$f":"[51]BYaak!$H$70","v":55568.340000000018},0,56550.349999999969,null,{"$f":"VLOOKUP(A19,'[50]balances from P12 EOY'!$B$6:$X$103,22,0)","v":0},0,0,null,112118.68999999999,55568.340000000018,56550.349999999969,{"$f":"VLOOKUP(A19,'[50]CFR ANALYSIS REVENUE INCOME '!$A$4:$S$97,19,0)","v":2131459.4299999997},5.2601840983668172E-2]
[11278,"Beit Shvidler Jewish Primary",{"$f":"VLOOKUP(A20,'[50]balances from P12 EOY'!$B$6:$X$103,20,0)","v":272.49},{"$f":"[51]BeitShv!$H$69","v":72683.38},0,-72410.89,null,{"$f":"VLOOKUP(A20,'[50]balances from P12 EOY'!$B$6:$X$103,22,0)","v":-0.23},0,-0.23,null,272.26,72683.38,-72411.12000000001,{"$f":"VLOOKUP(A20,'[50]CFR ANALYSIS REVENUE INCOME '!$A$4:$S$97,19,0)","v":1694012.71},1.6085475533415567E-4]
[10045,"Bell Lane School",{"$f":"VLOOKUP(A21,'[50]balances from P12 EOY'!$B$6:$X$103,20,0)","v":9828.5499999999956},{"$f":"[51]Bell!$H$76","v":100729.36999999997},0,-90900.819999999978,null,{"$f":"VLOOKUP(A21,'[50]balances from P12 EOY'!$B$6:$X$103,22,0)","v":24220.880000000001},{"$f":"[51]Bell!$H$89","v":979.74000000000228},23241.14,null,34049.429999999993,101709.10999999997,-67659.679999999978,{"$f":"VLOOKUP(A21,'[50]CFR ANALYSIS REVENUE INCOME '!$A$4:$S$97,19,0)","v":2650183.0999999996},3.7086305470742744E-3]
[10115,"Blessed Dominic RC School",{"$f":"VLOOKUP(A22,'[50]balances from P12 EOY'!$B$6:$X$103,20,0)","v":380699.33},{"$f":"[51]BDom!$H$72","v":214487.75},0,166211.58000000002,null,{"$f":"VLOOKUP(A22,'[50]balances from P12 EOY'!$B$6:$X$103,22,0)","v":1},{"$f":"[51]BDom!$H$78","v":1},0,null,380700.33,214488.75,166211.58000000002,{"$f":"VLOOKUP(A22,'[50]CFR ANALYSIS REVENUE INCOME '!$A$4:$S$97,19,0)","v":2533577.2799999998},0.15026158191630137]
[10047,"Brookland Infant School",{"$f":"VLOOKUP(A23,'[50]balances from P12 EOY'!$B$6:$X$103,20,0)","v":137149.68},{"$f":"[51]BrookI!$H$71","v":118776.9},0,18372.78,null,{"$f":"VLOOKUP(A23,'[50]balances from P12 EOY'!$B$6:$X$103,22,0)","v":16994.12},{"$f":"[51]BrookI!$H$81","v":9148},7846.119999999999,null,154143.79999999999,127924.9,26218.899999999994,{"$f":"VLOOKUP(A23,'[50]CFR ANALYSIS REVENUE INCOME '!$A$4:$S$97,19,0)","v":1749185.2099999997},7.84077519155333E-2]
[10046,"Brookland Junior School",{"$f":"VLOOKUP(A24,'[50]balances from P12 EOY'!$B$6:$X$103,20,0)","v":159321.4},{"$f":"[51]BrookJ!$H$73","v":154040.26999999999},0,5281.1300000000047,null,{"$f":"VLOOKUP(A24,'[50]balances from P12 EOY'!$B$6:$X$103,22,0)","v":7148.89},{"$f":"[51]BrookJ!$H$84","v":-4.9999999998835844E-2},7148.94,null,166470.29,154040.22,12430.070000000007,{"$f":"VLOOKUP(A24,'[50]CFR ANALYSIS REVENUE INCOME '!$A$4:$S$97,19,0)","v":1854665.9000000004},8.5903018975007822E-2]
[10048,"Brunswick Park School",{"$f":"VLOOKUP(A25,'[50]balances from P12 EOY'!$B$6:$X$103,20,0)","v":198361.54},{"$f":"[51]BrunsP!$H$72","v":265273.83},0,-66912.290000000008,null,{"$f":"VLOOKUP(A25,'[50]balances from P12 EOY'!$B$6:$X$103,22,0)","v":17664.259999999998},{"$f":"[51]BrunsP!$H$85","v":1546.3},16117.96,null,216025.80000000002,266820.13,-50794.329999999987,{"$f":"VLOOKUP(A25,'[50]CFR ANALYSIS REVENUE INCOME '!$A$4:$S$97,19,0)","v":2671533.5300000003},7.4250065654238667E-2]
[10118,"Chalgrove School",{"$f":"VLOOKUP(A26,'[50]balances from P12 EOY'!$B$6:$X$103,20,0)","v":123089.43},{"$f":"[51]Chal!$H$72","v":113348.11000000007},0,9741.3199999999197,null,{"$f":"VLOOKUP(A26,'[50]balances from P12 EOY'!$B$6:$X$103,22,0)","v":-0.35},{"$f":"[51]Chal!$H$83","v":6956.75},-6957.1,null,123089.07999999999,120304.86000000007,2784.2199999999139,{"$f":"VLOOKUP(A26,'[50]CFR ANALYSIS REVENUE INCOME '!$A$4:$S$97,19,0)","v":1596931.07},7.7078737030271433E-2]
[10049,"Childs Hill School",{"$f":"VLOOKUP(A27,'[50]balances from P12 EOY'!$B$6:$X$103,20,0)","v":57091.01},{"$f":"[51]ChildsH!$H$73","v":6740.5399999999818},0,50350.470000000023,null,{"$f":"VLOOKUP(A27,'[50]balances from P12 EOY'!$B$6:$X$103,22,0)","v":15425.480000000003},{"$f":"[51]ChildsH!$H$84","v":0},15425.480000000003,null,72516.490000000005,6740.5399999999818,65775.950000000026,{"$f":"VLOOKUP(A27,'[50]CFR ANALYSIS REVENUE INCOME '!$A$4:$S$97,19,0)","v":2813377.5},2.0292694457107161E-2]
[10050,"Christ Church CE School",{"$f":"VLOOKUP(A28,'[50]balances from P12 EOY'!$B$6:$X$103,20,0)","v":305864.53000000003},{"$f":"[51]ChristC!$H$69","v":262448.06},0,43416.47000000003,null,{"$f":"VLOOKUP(A28,'[50]balances from P12 EOY'!$B$6:$X$103,22,0)","v":0},{"$f":"[51]ChildsH!$H$84","v":0},0,null,305864.53000000003,262448.06,43416.47000000003,{"$f":"VLOOKUP(A28,'[50]CFR ANALYSIS REVENUE INCOME '!$A$4:$S$97,19,0)","v":1239774.74},0.24670976116193497]
[10051,"Church Hill School",{"$f":"VLOOKUP(A29,'[50]balances from P12 EOY'!$B$6:$X$103,20,0)","v":-63377.67},{"$f":"[51]ChurchH!$H$70","v":71783.81},0,-135161.47999999998,null,{"$f":"VLOOKUP(A29,'[50]balances from P12 EOY'!$B$6:$X$103,22,0)","v":0.45},{"$f":"[51]ChurchH!$H$81","v":-0.25},0.7,null,-63377.22,71783.56,-135160.78,{"$f":"VLOOKUP(A29,'[50]CFR ANALYSIS REVENUE INCOME '!$A$4:$S$97,19,0)","v":1249785.7300000002},-5.0710828647403415E-2]
[10054,"Colindale School",{"$f":"VLOOKUP(A30,'[50]balances from P12 EOY'!$B$6:$X$103,20,0)","v":499415.11},{"$f":"[51]Colin!$H$72","v":500697.81999999995},0,-1282.7099999999627,null,{"$f":"VLOOKUP(A30,'[50]balances from P12 EOY'!$B$6:$X$103,22,0)","v":13174.08},{"$f":"[51]Colin!$H$85","v":0},13174.08,null,512589.19,500697.81999999995,11891.370000000054,{"$f":"VLOOKUP(A30,'[50]CFR ANALYSIS REVENUE INCOME '!$A$4:$S$97,19,0)","v":4224334.4400000004},0.11822338337397356]
[10055,"Coppetts Wood School",{"$f":"VLOOKUP(A31,'[50]balances from P12 EOY'!$B$6:$X$103,20,0)","v":453369.01},{"$f":"[51]Coppet!$H$76","v":445664.48},0,7704.5300000000279,null,{"$f":"VLOOKUP(A31,'[50]balances from P12 EOY'!$B$6:$X$103,22,0)","v":13645},{"$f":"[51]Coppet!$H$87","v":14118},-473,null,467014.01,459782.48,7231.5300000000279,{"$f":"VLOOKUP(A31,'[50]CFR ANALYSIS REVENUE INCOME '!$A$4:$S$97,19,0)","v":2191768.2600000002},0.20685079635198292]
[10056,"Courtland School",{"$f":"VLOOKUP(A32,'[50]balances from P12 EOY'!$B$6:$X$103,20,0)","v":97507.69},{"$f":"[51]Court!$H$74","v":92609.3},0,4898.3899999999994,null,{"$f":"VLOOKUP(A32,'[50]balances from P12 EOY'!$B$6:$X$103,22,0)","v":12191.2},{"$f":"[51]Court!$H$86","v":0.66},12190.54,null,109698.89,92609.96,17088.929999999993,{"$f":"VLOOKUP(A32,'[50]CFR ANALYSIS REVENUE INCOME '!$A$4:$S$97,19,0)","v":1193194.56},8.1719857991977438E-2]
[10057,"Cromer Road School",{"$f":"VLOOKUP(A33,'[50]balances from P12 EOY'!$B$6:$X$103,20,0)","v":41632.239999999983},{"$f":"[51]Cromer!$H$71","v":173552.5},0,-131920.26,null,{"$f":"VLOOKUP(A33,'[50]balances from P12 EOY'!$B$6:$X$103,22,0)","v":3401.39},{"$f":"[51]Cromer!$H$82","v":14872.5},-11471.11,null,45033.629999999983,188425,-143391.37000000002,{"$f":"VLOOKUP(A33,'[50]CFR ANALYSIS REVENUE INCOME '!$A$4:$S$97,19,0)","v":2181030.8199999998},1.9088331819171626E-2]
[10083,"Danegrove School",{"$f":"VLOOKUP(A34,'[50]balances from P12 EOY'!$B$6:$X$103,20,0)","v":396844.68},{"$f":"[51]Daneg!$H$72","v":351920.21},0,44924.469999999972,null,{"$f":"VLOOKUP(A34,'[50]balances from P12 EOY'!$B$6:$X$103,22,0)","v":36084.6},{"$f":"[51]Daneg!$H$82","v":647.25},35437.35,null,432929.27999999997,352567.46,80361.819999999949,{"$f":"VLOOKUP(A34,'[50]CFR ANALYSIS REVENUE INCOME '!$A$4:$S$97,19,0)","v":3523139.9000000004},0.11263948956440814]
[10059,"Deansbrook Infant School",{"$f":"VLOOKUP(A35,'[50]balances from P12 EOY'!$B$6:$X$103,20,0)","v":175544.96999999997},{"$f":"[51]DeansI!$H$70","v":116843.47999999992},0,58701.490000000049,null,{"$f":"VLOOKUP(A35,'[50]balances from P12 EOY'!$B$6:$X$103,22,0)","v":16265.809999999998},{"$f":"[51]DeansI!$H$81","v":13770},2495.8099999999977,null,191810.77999999997,130613.47999999992,61197.300000000047,{"$f":"VLOOKUP(A35,'[50]CFR ANALYSIS REVENUE INCOME '!$A$4:$S$97,19,0)","v":1737755.4400000002},0.10101822498107096]
[10061,"Dollis Infant School",{"$f":"VLOOKUP(A36,'[50]balances from P12 EOY'!$B$6:$X$103,20,0)","v":201376.68},{"$f":"[51]DollisI!$H$72","v":184963.85},0,16412.829999999987,null,{"$f":"VLOOKUP(A36,'[50]balances from P12 EOY'!$B$6:$X$103,22,0)","v":22953.37},{"$f":"[51]DollisI!$H$82","v":14581.349999999999},8372.02,null,224330.05,199545.2,24784.849999999977,{"$f":"VLOOKUP(A36,'[50]CFR ANALYSIS REVENUE INCOME '!$A$4:$S$97,19,0)","v":1661051.8199999996},0.12123443566017106]
[10060,"Dollis Junior School",{"$f":"VLOOKUP(A37,'[50]balances from P12 EOY'!$B$6:$X$103,20,0)","v":119157.27},{"$f":"[51]DollisJ!$H$70","v":61398.239999999983},0,57759.030000000021,null,{"$f":"VLOOKUP(A37,'[50]balances from P12 EOY'!$B$6:$X$103,22,0)","v":12486.859999999997},{"$f":"[51]DollisJ!$H$81","v":6403.5},6083.3599999999969,null,131644.13,67801.739999999991,63842.390000000014,{"$f":"VLOOKUP(A37,'[50]CFR ANALYSIS REVENUE INCOME '!$A$4:$S$97,19,0)","v":2070510.01},5.7549719356343516E-2]
[10063,"Edgware Primary",{"$f":"VLOOKUP(A38,'[50]balances from P12 EOY'!$B$6:$X$103,20,0)","v":91594.950000000041},{"$f":"[51]EdgwP!$H$72","v":56561.459999999992},0,35033.490000000049,null,{"$f":"VLOOKUP(A38,'[50]balances from P12 EOY'!$B$6:$X$103,22,0)","v":-8.9999999995343388E-2},{"$f":"[51]EdgwP!$H$85","v":0.3700000000023283},-0.45999999999767172,null,91594.860000000044,56561.829999999994,35033.03000000005,{"$f":"VLOOKUP(A38,'[50]CFR ANALYSIS REVENUE INCOME '!$A$4:$S$97,19,0)","v":3480624.22},2.6315667595969334E-2]
[10064,"Fairway School",{"$f":"VLOOKUP(A39,'[50]balances from P12 EOY'!$B$6:$X$103,20,0)","v":139564.69999999998},{"$f":"[51]Fair!$H$75","v":167149.75000000009},0,-27585.050000000105,null,{"$f":"VLOOKUP(A39,'[50]balances from P12 EOY'!$B$6:$X$103,22,0)","v":15853.93},{"$f":"[51]Fair!$H$86","v":21468.89},-5614.9599999999991,null,155418.62999999998,188618.64000000007,-33200.010000000097,{"$f":"VLOOKUP(A39,'[50]CFR ANALYSIS REVENUE INCOME '!$A$4:$S$97,19,0)","v":2169879.7600000002},6.4319093883801179E-2]
[10065,"Foulds School",{"$f":"VLOOKUP(A40,'[50]balances from P12 EOY'!$B$6:$X$103,20,0)","v":124643.79999999994},{"$f":"[51]Fould!$H$72","v":171440.37},0,-46796.570000000051,null,{"$f":"VLOOKUP(A40,'[50]balances from P12 EOY'!$B$6:$X$103,22,0)","v":-0.73},{"$f":"[51]Fould!$H$85","v":10533.75},-10534.48,null,124643.06999999995,181974.12,-57331.050000000047,{"$f":"VLOOKUP(A40,'[50]CFR ANALYSIS REVENUE INCOME '!$A$4:$S$97,19,0)","v":1564373.17},7.9676513500931467E-2]
{"$rows_left_out":75}