{"text_format":"1","workbook":"xlsx","n_sheets":18,"sheets":["Cost Centres (2)","Front Page","Capital Details Instruction VA","Capital Details Instructions","Capital Form","Adjustment Form Instructions","End of Yr Adjustment Form","Example Yr End Adjustment","Bank Movement Instructions","Bank Movement Form","Drop down options","Example Bank Movement Form","Integra Upload","Drs & Crs Analysis","cost centres","Cost Centres ","LOOK UPS","Sheet1"],"not_rendered":{"charts":0,"images":1,"macros":1,"external_links":5,"defined_names":8,"comments":3,"pivot_tables":0},"unopened":[],"bounds":{"document_bytes":16777216,"sheet_cells":100000,"rows_first":2000,"rows_last":500,"rows_between":2000,"halvings":0,"cell_chars":16384,"cell_head_chars":4096},"cells_cut":0,"cells_raw":0,"read":"whole","date_system":"1900"}

{"sheet":"Cost Centres (2)","index":0,"n_rows":117,"n_cols":3,"rows_kept":117,"cut":false,"hidden":false,"merged":[]}
[]
["SAP Cost Centre","School","DfES NO."]
[]
[10040,"All Saints' CE School (NW2)",3300]
[10042,"All Saints' CE School (N20)",3317]
[10043,"Annunciation RC Infant School",3500]
[10044,"Barnfield School",2002]
[10045,"Bell Lane School",2003]
[10046,"Brookland Junior School",2007]
[10047,"Brookland Infant School",2008]
{"$rows_left_out":108}
{"sheet":"Front Page","index":1,"n_rows":98,"n_cols":27,"rows_kept":98,"cut":false,"hidden":false,"merged":[[28,11,28,14],[0,7,0,11],[1,7,1,11],[1,13,1,15],[2,13,2,15],[19,12,24,14],[8,12,16,14],[5,2,5,9]]}
[null,null,null,null,null,null,null,null,null,null,null,null,null,null,null,null,null,null,null,null,null,null,null,null,null,"Please choose your School"]
[null,null,null,null,null,null,null,"Please choose your School",null,null,null,null,null,"2017/18 END OF YEAR FORMS",null,null,null,null,null,null,null,null,null,{"$f":"VLOOKUP(H2,Z:AA,2,0)","v":0},null,"Brookhill Nursery",10130]
[null,null,null,null,null,null,null,null,null,null,null,null,null,{"$f":"NOW()","v":"2018-03-07T15:15:12.720"},null,null,null,null,null,null,null,null,null,null,null,"Hampden Way Nursery",10131]
[null,null,null,null,null,null,null,null,null,null,null,null,null,null,null,null,null,null,null,null,null,null,null,null,null,"Moss Hall Nursery",10132]
[null,null,null,null,null,null,null,null,null,null,null,null,null,null,null,null,null,null,null,null,null,null,null,null,null,"St Margaret's Nursery",10133]
[null,null,"To be submitted by Monday 23rd April 2018",null,null,null,null,null,null,null,null,null,"Notes:"]
[null,null,null,null,null,null,null,null,null,null,null,null,null,null,null,null,null,null,null,null,null,null,null,null,null,"Akiva",11094]
[null,null,null,null,null,null,null,null,null,null,null,null,null,null,null,null,null,null,null,null,null,null,null,null,null,"All Saints' CE School (N20)",10042]
[null,null,null,null,null,null,null,null,null,null,null,null,"Once completed, save this file to your computer in an EXCEL FORMAT renaming it \"school name\"  Analysis of Bank Movement 2017-18. Once saved, this file should be attached to an email and returned  to schools.accountancy@barnet.gov.uk by Monday 23rd April 2018.",null,null,null,null,null,null,null,null,null,null,null,null,"All Saints' CE School (NW2)",10040]
[null,null,null,null,null,null,null,null,null,null,null,null,null,null,null,null,null,null,null,null,null,null,null,null,null,"Annunciation RC Infant School",10043]
{"$rows_left_out":89}
{"sheet":"Capital Details Instruction VA","index":2,"n_rows":31,"n_cols":1,"rows_kept":31,"cut":false,"hidden":false,"merged":[]}
["Instructions for completion of the Capital Detail Form - VA and Foundation schools only"]
["Background"]
["The Governing Body of a VA school are responsible for meeting all capital expenditure"]
["Therefore all capital transactions should should be processed in the governing body's accounts."]
["If capital expenditure is accounted for in the Council's accounts for a VA school, this could lead to these assets being erroneously included in the Council's assets. "]
[]
["The only exception are loose ICT items"]
["Therefore there should not be any transactions on the following codes:"]
["CI01, CI03, CE01, CE02, CE03"]
["Loose ICT items may be coded in:"]
{"$rows_left_out":22}
{"sheet":"Capital Details Instructions","index":3,"n_rows":41,"n_cols":1,"rows_kept":41,"cut":false,"hidden":false,"merged":[]}
["Instructions for completion of the Capital Detail Form Community Schools only"]
["Background"]
[]
["The LA require details of all schools capital projects and how they were funded for the following reasons."]
["1. To ensure there is a complete record of the LA assets for inclusion in the LA accounts."]
["2. To enable the LA to certify to the DfE that the Devolved Formula Capital Grant, which has been devolved to schools "]
["has been spent within the permitted three years and five months."]
[]
["Instructions"]
[]
{"$rows_left_out":32}
{"sheet":"Capital Form","index":4,"n_rows":128,"n_cols":17,"rows_kept":128,"cut":false,"hidden":false,"merged":[[2,2,2,4],[7,6,8,6],[15,6,16,6],[18,6,19,6],[21,6,22,6],[92,2,92,3],[30,6,31,6],[52,6,53,6],[55,6,56,6],[49,6,50,6],[24,6,25,6],[27,6,28,6],[24,8,25,8],[27,8,28,8],[55,8,56,8],[38,8,39,8],[30,8,31,8],[41,8,42,8],[44,8,45,8],[41,6,42,6],[38,6,39,6],[44,6,45,6],[7,8,8,8],[15,8,16,8],[18,8,19,8],[49,8,50,8],[52,8,53,8]]}
["Capital Expenditure & Funding 2017/18 - Details ",null,null,null,null,null,{"$f":"+'Front Page'!X2","v":0}]
[null,null,null,null,null,null,null,null,null,"Please choose your school",null,null,null,"Complete"]
[null,null,"School name",null,null,null,null,null,null,"Brookhill Nursery","Nursery","Community",null,"Incomplete"]
[null,null,null,null,null,"Is this a \"Nil Return\"? - please select Yes or No in box",null,null,null,"Hampden Way Nursery ","Nursery","Community"]
["Expenditure",null,null,null,null,null,null,null,null,"Moss Hall Nursery","Nursery","Community",null,null,null,null,"Yes"]
["Where expenditure is recorded please provide details of the acquisition",null,null,null,null,null,null,null,null,"St Margaret's Nursery ","Nursery","Community",null,null,null,null,"No"]
[null,null,null,null,"Amount £'s","Description","Work Complete/Incomplete?",null,"Financially Complete/Incomplete?"]
["CE01","Acquisition of land & existing buildings",null,null,0,"Project 1 - ",null,null,null,"Akiva","Primary","VA"]
["CE01","Total",0,null,null,null,null,null,null,"All Saints N20","Primary","VA"]
[null,null,null,null,null,null,null,null,null,"All Saints NW2","Primary","VA"]
{"$rows_left_out":119}
{"sheet":"Adjustment Form Instructions","index":5,"n_rows":30,"n_cols":1,"rows_kept":30,"cut":false,"hidden":false,"merged":[]}
["Instructions for completion of the End of Year Adjustment Form"]
[]
[]
["COMPLETING ACCRUAL FORM"]
["STEP 1 - Schools details"]
["·         Choose your School from the drop down menu"]
["·         The School’s Cost Centre number will automatically populate"]
["·         Complete the Preparer’s details (name, email, telephone no.)"]
["·         The Authoriser should sign the form once it has been completed"]
["STEP 2 – Transaction details to be entered"]
{"$rows_left_out":21}
{"sheet":"End of Yr Adjustment Form","index":6,"n_rows":67,"n_cols":16,"rows_kept":67,"cut":false,"hidden":false,"merged":[[62,1,62,7],[63,1,63,7],[64,1,64,7],[65,1,65,7],[66,1,66,7],[57,1,57,7],[58,1,58,7],[59,1,59,7],[60,1,60,7],[61,1,61,7],[45,1,45,6],[45,7,45,8],[46,1,46,6],[46,7,46,8],[0,0,0,2],[0,4,0,9],[1,4,1,9],[50,7,50,8],[47,1,47,6],[47,7,47,8],[48,1,48,6],[48,7,48,8],[49,1,49,2],[49,7,49,8]]}
["End of Year Adjustments (Accruals) - Debtors/Creditors/Receipts in Advance/Payments in Advance",null,null,null,"SCHOOLS ARE ONLY ALLOWED TO ACCRUE FOR AMOUNTS OVER £1K PER INVOICE. If your invoice is under £1k you should not accrue."]
[null,null,null,null,"ACCURALS MUST EXCLUDE VAT"]
["Schools Name:                              ","School name",null,null,"PREPARER NAME"]
["Financial Year:","2017/18",null,null,"PREPARER'S EMAIL ADDRESS:"]
["Cost Centre:",{"$f":"VLOOKUP(B3,'[2]LOOK UPS '!$A$3:$C$110,3,FALSE)","v":"cost centre"},null,null,"PREPARER'S TELEPHONE NUMBER:"]
[null,null,null,null,"Authoriser:"]
[]
["Type (Please select from the drop down list)","Authorised by:","Supplier or Customer Name","Invoice Number / Order No.","Description","Date Goods/ Services Received","Value (Only include amounts greater than £1,000)","Is the amount actual or estimated?","Classification of the debtor/creditor. Who is the debtor or creditor with?","CFR Code","RM Budget Code",null,null,"CHECK"]
[null,null,null,null,null,null,null,null,null,null,null,{"$f":"LEFT(J9,2)","v":""},{"$f":"L9&A9","v":""},{"$f":"IF(M9='LOOK UPS'!$A$176,'LOOK UPS'!$B$176,IF(M9='LOOK UPS'!$A$177,'LOOK UPS'!$B$177,IF(M9='LOOK UPS'!$A$178,'LOOK UPS'!$B$178,IF(M9='LOOK UPS'!$A$179,'LOOK UPS'!$B$179,IF(M9='LOOK UPS'!$A$180,'LOOK UPS'!$B$180,IF(M9='LOOK UPS'!$A$181,'LOOK UPS'!$B$181,IF(M9='LOOK UPS'!$A$182,'LOOK UPS'!$B$182,IF(M9='LOOK UPS'!$A$183,'LOOK UPS'!$B$183,IF(M9='LOOK UPS'!$A$184,'LOOK UPS'!$B$184,IF(M9='LOOK UPS'!$A$185,'LOOK UPS'!$B$185,IF(M9='LOOK UPS'!$A$186,'LOOK UPS'!$B$186,IF(M9='LOOK UPS'!$A$187,'LOOK UPS'!$B$187,IF(M9='LOOK UPS'!$A$188,'LOOK UPS'!$B$188,IF(M9='LOOK UPS'!$A$189,'LOOK UPS'!$B$189,IF(M9='LOOK UPS'!$A$190,'LOOK UPS'!$B$190,IF(M9='LOOK UPS'!$A$191,'LOOK UPS'!$B$191,IF(M9='LOOK UPS'!$A$192,'LOOK UPS'!$B$192,IF(M9='LOOK UPS'!$A$193,'LOOK UPS'!$B$193,IF(M9='LOOK UPS'!$A$194,'LOOK UPS'!$B$194,IF(M9='LOOK UPS'!$A$195,'LOOK UPS'!$B$195,IF(M9='LOOK UPS'!$A$196,'LOOK UPS'!$B$196,IF(M9='LOOK UPS'!$A$197,'LOOK UPS'!$B$197,IF(M9='LOOK UPS'!$A$198,'LOOK UPS'!$B$198,IF(M9='LOOK UPS'!$A$199,'LOOK UPS'!$B$199,IF(M9='LOOK UPS'!$A$200,'LOOK UPS'!$B$200,IF(M9='LOOK UPS'!$A$201,'LOOK UPS'!$B$201,IF(M9='LOOK UPS'!$A$202,'LOOK UPS'!$B$202,IF(M9='LOOK UPS'!$A$203,'LOOK UPS'!$B$203,IF(M9='LOOK UPS'!$A$204,'LOOK UPS'!$B$204,IF(M9='LOOK UPS'!$A$205,'LOOK UPS'!$B$205,IF(M9='LOOK UPS'!$A$206,'LOOK UPS'!$B$206,IF(M9='LOOK UPS'!$A$207,'LOOK UPS'!$B$207))))))))))))))))))))))))))))))))","v":false},{"$f":"A9&I9","v":""},{"$f":"A9&J9","v":""}]
[null,null,null,null,null,null,null,null,null,null,null,{"$f":"LEFT(J10,2)","v":""},{"$f":"L10&A10","v":""},{"$f":"IF(M10='LOOK UPS'!$A$176,'LOOK UPS'!$B$176,IF(M10='LOOK UPS'!$A$177,'LOOK UPS'!$B$177,IF(M10='LOOK UPS'!$A$178,'LOOK UPS'!$B$178,IF(M10='LOOK UPS'!$A$179,'LOOK UPS'!$B$179,IF(M10='LOOK UPS'!$A$180,'LOOK UPS'!$B$180,IF(M10='LOOK UPS'!$A$181,'LOOK UPS'!$B$181,IF(M10='LOOK UPS'!$A$182,'LOOK UPS'!$B$182,IF(M10='LOOK UPS'!$A$183,'LOOK UPS'!$B$183,IF(M10='LOOK UPS'!$A$184,'LOOK UPS'!$B$184,IF(M10='LOOK UPS'!$A$185,'LOOK UPS'!$B$185,IF(M10='LOOK UPS'!$A$186,'LOOK UPS'!$B$186,IF(M10='LOOK UPS'!$A$187,'LOOK UPS'!$B$187,IF(M10='LOOK UPS'!$A$188,'LOOK UPS'!$B$188,IF(M10='LOOK UPS'!$A$189,'LOOK UPS'!$B$189,IF(M10='LOOK UPS'!$A$190,'LOOK UPS'!$B$190,IF(M10='LOOK UPS'!$A$191,'LOOK UPS'!$B$191,IF(M10='LOOK UPS'!$A$192,'LOOK UPS'!$B$192,IF(M10='LOOK UPS'!$A$193,'LOOK UPS'!$B$193,IF(M10='LOOK UPS'!$A$194,'LOOK UPS'!$B$194,IF(M10='LOOK UPS'!$A$195,'LOOK UPS'!$B$195,IF(M10='LOOK UPS'!$A$196,'LOOK UPS'!$B$196,IF(M10='LOOK UPS'!$A$197,'LOOK UPS'!$B$197,IF(M10='LOOK UPS'!$A$198,'LOOK UPS'!$B$198,IF(M10='LOOK UPS'!$A$199,'LOOK UPS'!$B$199,IF(M10='LOOK UPS'!$A$200,'LOOK UPS'!$B$200,IF(M10='LOOK UPS'!$A$201,'LOOK UPS'!$B$201,IF(M10='LOOK UPS'!$A$202,'LOOK UPS'!$B$202,IF(M10='LOOK UPS'!$A$203,'LOOK UPS'!$B$203,IF(M10='LOOK UPS'!$A$204,'LOOK UPS'!$B$204,IF(M10='LOOK UPS'!$A$205,'LOOK UPS'!$B$205,IF(M10='LOOK UPS'!$A$206,'LOOK UPS'!$B$206,IF(M10='LOOK UPS'!$A$207,'LOOK UPS'!$B$207))))))))))))))))))))))))))))))))","v":false},"",""]
{"$rows_left_out":58}
{"sheet":"Example Yr End Adjustment","index":7,"n_rows":54,"n_cols":14,"rows_kept":54,"cut":false,"hidden":false,"merged":[[33,1,33,6],[33,7,33,8],[0,0,0,2],[0,4,0,9],[1,4,1,9],[32,1,32,6],[32,7,32,8],[34,1,34,6],[34,7,34,8],[35,1,35,6],[35,7,35,8],[36,1,36,2],[36,7,36,8],[37,7,37,8],[44,1,44,7],[45,1,45,7],[46,1,46,7],[53,1,53,7],[47,1,47,7],[48,1,48,7],[49,1,49,7],[50,1,50,7],[51,1,51,7],[52,1,52,7]]}
["End of Year Accruals- Debtors/Creditors/Receipts in Advance/Payments in Advance",null,null,null,"SCHOOLS ARE ONLY ALLOWED TO ACCRUE FOR AMOUNTS OVER £1K PER INVOICE. If your invoice is under £1k you should not accrue."]
[null,null,null,null,"ACCURALS MUST EXCLUDE VAT"]
["Schools Name:                              ","School name",null,null,"PREPARER NAME"]
["Financial Year:","2017/18",null,null,"PREPARER'S EMAIL ADDRESS:"]
["Cost Centre:",{"$f":"VLOOKUP(B3,'[2]LOOK UPS '!$A$3:$C$110,3,FALSE)","v":"cost centre"},null,null,"PREPARER'S TELEPHONE NUMBER:"]
[null,null,null,null,"Authoriser:"]
[]
["Type (Please select from the drop down list)","Authorised by:","Supplier or Customer Name","Invoice Number / Order No.","Description","Date Goods/ Services Received","Value (Only include amounts greater than £1,000)","Is the amount actual or estimated?","Classification of the debtor/creditor. Who is the debtor or creditor with?","CFR Code","RM Budget Code",null,null,"CHECK"]
["Creditor",null,null,null,"School Meals Feb & March",null,1000,null,"Cambridge Education/ISS","E25",null,{"$f":"LEFT(J9,2)","v":"E2"},{"$f":"L9&A9","v":"E2Creditor"},"good"]
["Debtor",null,null,null,"SEN",null,5650,null,"Local Authorities excluding London Borough of Barnet","I03",null,{"$f":"LEFT(J10,2)","v":"I0"},{"$f":"L10&A10","v":"I0Debtor"},"good"]
{"$rows_left_out":45}
{"sheet":"Bank Movement Instructions","index":8,"n_rows":41,"n_cols":2,"rows_kept":41,"cut":false,"hidden":false,"merged":[]}
["Instructions for completing the Analysis of Bank Movement 21st - 31st March 2018"]
[]
[]
["COMPLETING THE ANALYSIS OF BANK STATEMENT MOVEMENT FORM"]
["STEP 1 - Schools Details","Drop Down Menu"]
["·         Choose your School from the drop down menu","Included in the year end return as a debtor"]
["·         The School’s Cost Centre number will automatically populate","Included in the year end return as a creditor"]
["STEP 2 - Account Balances","Included in the year end return as a receipt in advance"]
["·         Enter the Bank balance at 20th March 2018 (close of business)","Included in the year end return as a payment in advance"]
["·         Enter the Bank balance at 31st March 2018 (close of business)","Included in the year end return but as an estimate, the actual is immaterially different (>£1k)"]
{"$rows_left_out":32}
{"sheet":"Bank Movement Form","index":9,"n_rows":41,"n_cols":13,"rows_kept":41,"cut":false,"hidden":false,"merged":[[8,3,8,5],[9,3,9,5],[0,5,5,7]]}
["ANALYSIS OF BANK MOVEMENT FOR THE PERIOD 21/03/2018 TO 31/03/2018",null,null,null,null,"IF THE BANK TRANSACTIONS FROM THE 21/3/2018 TO 31/3/2018 ARE NOT ALREADY IN YOUR ACCOUNTING SYSTEM FOR 2017/18 DATA, YOU MUST NOT GO BACK INTO 2017/18 DATA TO PROCESS THE TRANSACTIONS.  THE TRANSACTIONS MUST BE POSTED IN THE NEW YEAR'S DATA 2018/19"]
[]
[{"$f":"'[4]Closure Return Checklist'!A3","v":"Schools Name:                              "},{"$f":"'Front Page'!H2","v":"Please choose your School"}]
[{"$f":"'[4]Closure Return Checklist'!A4","v":"Financial Year:"},"2017/18"]
[{"$f":"'[4]Closure Return Checklist'!A5","v":"Cost Centre:"},{"$f":"VLOOKUP(B3,'LOOK UPS'!$A$3:$C$110,3,FALSE)","v":{"$error":"#N/A"}}]
[]
[]
[null,"£",null,null,null,null,null,"Guidance"]
["Bank Balance as at 20/03/2018",4589.25,null,"IF YOUR ACCOUNT BALANCE WAS OVERDRAWN ON THE 20/03/2018, PLEASE INSERT \"-\" IN FRONT OF THE FIGURE",null,null,null,"this must equal the bank statement balance. Please include a copy of the 20/03/2018 bank statement. This is your end of day balance."]
["Bank Balance as at 31/03/2018",3214.2,null,"IF YOUR ACCOUNT BALANCE WAS OVERDRAWN ON THE 31/03/2018, PLEASE INSERT \"-\" IN FRONT OF THE FIGURE",null,null,null,"this must equal the bank statement balance. Please include a copy of the 31/03/2018 bank statement. This is your end of day balance."]
{"$rows_left_out":32}
{"sheet":"Drop down options","index":10,"n_rows":12,"n_cols":1,"rows_kept":12,"cut":false,"hidden":false,"merged":[]}
["Included in the year end return as a debtor"]
["Included in the year end return as a creditor"]
["Included in the year end return as a receipt in advance"]
["Included in the year end return as a payment in advance"]
["Included in the year end return but as an estimate, the actual is immaterially different (>£1k)"]
["Included in the 20th March bank rec as an unpresented income"]
["Included in the 20th March bank rec as an unpresented cheque"]
["Immaterial amount (less than £1k per amount) not a debtor/creditor/PIA/RIA"]
["Was not included in the year end return and was not in the 20th March bank reconciliation as an unpresented income/cheque"]
["This income relates to 2018/19"]
{"$rows_left_out":3}
{"sheet":"Example Bank Movement Form","index":11,"n_rows":41,"n_cols":8,"rows_kept":41,"cut":false,"hidden":false,"merged":[[0,5,5,7],[8,3,8,5],[9,3,9,5]]}
["ANALYSIS OF BANK MOVEMENT FOR THE PERIOD 21/03/2018 TO 31/03/2018",null,null,null,null,"IF THE BANK TRANSACTIONS FROM THE 21/3/2018 TO 31/3/2018 ARE NOT ALREADY IN YOUR ACCOUNTING SYSTEM FOR 2017/18 DATA, YOU MUST NOT GO BACK INTO 2017/18 DATA TO PROCESS THE TRANSACTIONS.  THE TRANSACTIONS MUST BE POSTED IN THE NEW YEAR'S DATA 2018/19"]
[]
[{"$f":"'[4]Closure Return Checklist'!A3","v":"Schools Name:                              "},"School"]
[{"$f":"'[4]Closure Return Checklist'!A4","v":"Financial Year:"},"2017/18"]
[{"$f":"'[4]Closure Return Checklist'!A5","v":"Cost Centre:"},{"$f":"VLOOKUP(B3,'[5]LOOK UPS'!$A$3:$C$110,3,FALSE)","v":"Cost Centre"}]
[]
[]
[null,"£",null,null,null,null,null,"Guidance"]
["Bank Balance as at 20/03/2018",4589.25,null,"IF YOUR ACCOUNT BALANCE WAS OVERDRAWN ON THE 20/03/2018, PLEASE INSERT \"-\" IN FRONT OF THE FIGURE",null,null,null,"this must equal the bank statement balance. Please include a copy of the 20/03/2018 bank statement. This is your end of day balance."]
["Bank Balance as at 31/03/2018",3214.2,null,"IF YOUR ACCOUNT BALANCE WAS OVERDRAWN ON THE 31/03/2018, PLEASE INSERT \"-\" IN FRONT OF THE FIGURE",null,null,null,"this must equal the bank statement balance. Please include a copy of the 31/03/2018 bank statement. This is your end of day balance."]
{"$rows_left_out":32}
{"sheet":"Integra Upload","index":12,"n_rows":116,"n_cols":8,"rows_kept":116,"cut":false,"hidden":false,"merged":[]}
[]
["GLs to be used:"]
[null,null,null,"Total Amount","GL code"]
["Creditor","Central Government including DfE or EFA",{"$f":"A4&B4","v":"CreditorCentral Government including DfE or EFA"},{"$f":"SUMIF('End of Yr Adjustment Form'!$O$9:$O$28,C4,'End of Yr Adjustment Form'!$G$9:$G$28)","v":0},946951,null,{"$f":"E4&B4","v":"946951Central Government including DfE or EFA"}]
["Creditor","Mayor/MOPAC/TFL","CreditorMayor/MOPAC/TFL",{"$f":"SUMIF('End of Yr Adjustment Form'!$O$9:$O$28,C5,'End of Yr Adjustment Form'!$G$9:$G$28)","v":0},946952,null,{"$f":"E5&B5","v":"946952Mayor/MOPAC/TFL"}]
["Creditor","Local Authorities excluding London Borough of Barnet",{"$f":"A6&B6","v":"CreditorLocal Authorities excluding London Borough of Barnet"},{"$f":"SUMIF('End of Yr Adjustment Form'!$O$9:$O$28,C6,'End of Yr Adjustment Form'!$G$9:$G$28)","v":0},946952,null,"946952Local Authorities excluding London Borough of Barnet"]
["Creditor","Cambridge Education/ISS","CreditorCambridge Education/ISS",{"$f":"SUMIF('End of Yr Adjustment Form'!$O$9:$O$28,C7,'End of Yr Adjustment Form'!$G$9:$G$28)","v":0},946962,null,"946962Cambridge Education/ISS"]
["Creditor","Capita (CSG/Customer Support Group)","CreditorCapita (CSG/Customer Support Group)",{"$f":"SUMIF('End of Yr Adjustment Form'!$O$9:$O$28,C8,'End of Yr Adjustment Form'!$G$9:$G$28)","v":0},946962,null,"946962Capita (CSG/Customer Support Group)"]
["Creditor","Regional Enterprise (RE)","CreditorRegional Enterprise (RE)",{"$f":"SUMIF('End of Yr Adjustment Form'!$O$9:$O$28,C9,'End of Yr Adjustment Form'!$G$9:$G$28)","v":0},946962,null,"946962Regional Enterprise (RE)"]
["Creditor","London Borough of Barnet excluding Cambridge Education and RE (Regional Enterprise).","CreditorLondon Borough of Barnet excluding Cambridge Education and RE (Regional Enterprise).",{"$f":"SUMIF('End of Yr Adjustment Form'!$O$9:$O$28,C10,'End of Yr Adjustment Form'!$G$9:$G$28)","v":0},924962,null,"924962London Borough of Barnet excluding Cambridge Education and RE (Regional Enterprise)."]
{"$rows_left_out":107}
{"sheet":"Drs & Crs Analysis","index":13,"n_rows":15,"n_cols":13,"rows_kept":15,"cut":false,"hidden":true,"merged":[[1,1,1,4],[1,5,1,8]]}
["Data to be transferred on to the Drs & Crs Schedule"]
[null,"Debtors / PIA",null,null,null,"Creditors / RIA"]
[null,924951,924952,924962,924958,946951,946952,946962,946960]
[null,"Debtors - Govt Dept.","Debtors - OLA's","Debtors - Other","Debtors - NHS Bodies","Creditors - Govt Dept.","Creditors - OLA's","Creditors - Other ","Creditors - NHS Bodies","Net Internal Creditors /Debtors"]
[{"$f":"'Front Page'!H2","v":"Please choose your School"},{"$f":"'Integra Upload'!B112-'Integra Upload'!C112","v":0},{"$f":"'Integra Upload'!B113-'Integra Upload'!C113","v":0},{"$f":"'Integra Upload'!B114-'Integra Upload'!C114","v":0},{"$f":"'Integra Upload'!B115-'Integra Upload'!C115","v":0},{"$f":"'Integra Upload'!B108-'Integra Upload'!C108","v":0},{"$f":"'Integra Upload'!B109-'Integra Upload'!C109","v":0},{"$f":"'Integra Upload'!B110-'Integra Upload'!C110","v":0},{"$f":"'Integra Upload'!B111-'Integra Upload'!C111","v":0},{"$f":"SUM(B5:I5)","v":0}]
[]
[]
[]
[]
[]
{"$rows_left_out":6}
{"sheet":"cost centres","index":14,"n_rows":117,"n_cols":3,"rows_kept":117,"cut":false,"hidden":true,"merged":[]}
[]
["School","DCSF","SAP Cost Centre"]
[]
["Brookhill Nursery",1000,10130]
["Hampden Way Nursery",1001,10131]
["Moss Hall Nursery",1002,10132]
["St Margaret's Nursery",1003,10133]
[]
["Akiva",3520,11094]
["All Saints' CE School (N20)",3317,10042]
{"$rows_left_out":108}
{"sheet":"Cost Centres ","index":15,"n_rows":117,"n_cols":3,"rows_kept":117,"cut":false,"hidden":true,"merged":[]}
[]
["SAP Cost Centre","School","DfES NO."]
[]
[10040,"All Saints' CE School (NW2)",3300]
[10042,"All Saints' CE School (N20)",3317]
[10043,"Annunciation RC Infant School",3500]
[10044,"Barnfield School",2002]
[10045,"Bell Lane School",2003]
[10046,"Brookland Junior School",2007]
[10047,"Brookland Infant School",2008]
{"$rows_left_out":108}
{"sheet":"LOOK UPS","index":16,"n_rows":207,"n_cols":3,"rows_kept":207,"cut":false,"hidden":false,"merged":[]}
[]
["School","DCSF","SAP Cost Centre"]
["School name",null,"cost centre"]
["Brookhill Nursery",1000,10130]
["Hampden Way Nursery",1001,10131]
["Moss Hall Nursery",1002,10132]
["St Margaret's Nursery",1003,10133]
["Akiva",3520,11094]
["All Saints' CE School (N20)",3317,10042]
["All Saints' CE School (NW2)",3300,10040]
{"$rows_left_out":198}
{"sheet":"Sheet1","index":17,"n_rows":0,"n_cols":0,"rows_kept":0,"cut":false,"hidden":true,"merged":[]}