{"text_format":"1","workbook":"xlsx","n_sheets":10,"sheets":["Front Page","OUTTURN STATEMENT","Indschs 16-17","check INTEGRA","Allocation of spring claim","FUNDING I01 I02 I03","FUNDING ALLOCATION","early retirement","CFR VAL","Sheet1"],"not_rendered":{"charts":0,"images":1,"macros":1,"external_links":61,"defined_names":3613,"comments":2,"pivot_tables":0},"unopened":[],"bounds":{"document_bytes":16777216,"sheet_cells":100000,"rows_first":2000,"rows_last":500,"rows_between":2000,"halvings":0,"cell_chars":16384,"cell_head_chars":4096},"cells_cut":0,"cells_raw":0,"read":"whole","date_system":"1900"}

{"sheet":"Front Page","index":0,"n_rows":101,"n_cols":25,"rows_kept":101,"cut":false,"hidden":false,"merged":[[8,3,9,3],[8,5,9,5]]}
[null,null,null,null,null,null,null,null,null,null,null,null,null,null,null,null,null,null,null,null,null,null,null,"Choose your school"]
[null,null,null,null,null,null,null,null,null,null,null,null,null,null,null,null,null,null,null,null,null,null,null,"Akiva",3520]
[null,null,null,null,null,null,null,null,null,null,null,null,null,null,null,null,null,null,null,null,null,null,null,"All Saints' CE School (N20)",3317]
[null,null,null,null,null,null,null,null,null,null,null,null,null,null,null,null,null,null,null,null,null,null,null,"All Saints' CE School (NW2)",3300]
[null,null,null,null,null,null,null,null,null,null,null,null,null,null,null,null,null,null,null,null,null,null,null,"Annunciation RC Infant School",3500]
[null,null,null,null,null,null,null,null,null,null,null,null,null,null,null,null,null,null,null,null,null,null,null,"Annunciation RC Junior School",3514]
[null,null,null,"2016-17 FINAL OUTTURN STATEMENTS",null,null,null,null,null,null,null,null,null,null,null,null,null,null,null,null,null,null,null,"Barnfield School",2002]
[null,null,null,null,null,null,null,null,null,null,null,null,null,null,null,null,null,null,null,null,null,null,null,"Beis Yaakov",2079]
[null,null,null,"Choose your school",null,{"$f":"VLOOKUP(D9,X:Y,2,0)","v":0},null,null,null,null,null,null,null,null,null,null,null,null,null,null,null,null,null,"Beit Shvidler",3524]
[null,null,null,null,null,null,null,null,null,null,null,null,null,null,null,null,null,null,null,null,null,null,null,"Bell Lane School",2003]
{"$rows_left_out":92}
{"sheet":"OUTTURN STATEMENT","index":1,"n_rows":166,"n_cols":5,"rows_kept":166,"cut":false,"hidden":false,"merged":[[38,8,38,9],[39,8,39,9],[32,8,32,9],[34,8,34,9],[35,8,35,9],[36,8,36,9],[37,8,37,9],[4,1,4,4],[4,7,4,9],[5,1,5,4],[6,1,6,4],[31,8,31,9]]}
[120]
[]
[null,null,null,null,{"$f":"'Front Page'!$F$9","v":0}]
[]
[null,"London Borough of Barnet"]
[null,"Summary of Final Outturn Position &"]
[null,"Statement of Central / Salary Account FY 2016-17"]
[null,null,null,"Option ",{"$f":"VLOOKUP($E$9,'FUNDING ALLOCATION'!B:E,4,0)","v":{"$error":"#N/A"}}]
[null,{"$f":"VLOOKUP(E10,A63:B170,2,0)","v":{"$error":"#N/A"}},null,"Cost Centre",{"$f":"VLOOKUP(E10,A:C,3,0)","v":{"$error":"#N/A"}}]
[null,null,null,"DfE No",{"$f":"'Front Page'!$F$9","v":0}]
{"$rows_left_out":157}
{"sheet":"Indschs 16-17","index":2,"n_rows":116,"n_cols":15,"rows_kept":116,"cut":false,"hidden":false,"merged":[[0,2,0,14],[1,3,1,6],[1,8,1,10],[1,12,1,14]]}
[null,null,"Final Individual School Outturn Balances 2016-17"]
[null,null,null,"Revenue",null,null,null,null,"Capital",null,null,null,"Total Balance"]
[null,1,2,3,4,5,6,7,8,9,10,11,12,13,14]
[null,"Cost Centre","School","As at 31.03.17","Balance as % Final Budget Share 14-15","As at 31.03.16","Increase / (decrease)",null,{"$f":"D4","v":"As at 31.03.17"},{"$f":"F4","v":"As at 31.03.16"},"Increase / (decrease)",null,{"$f":"D4","v":"As at 31.03.17"},{"$f":"F4","v":"As at 31.03.16"},"Increase / (decrease)"]
[1000,10130,"Brookhill",158461.67000000001,0,145359,13102.670000000013,null,1.25,1,0.25,null,158462.92000000001,145360,13102.920000000013]
[1001,10131,"Hampden Way",125592.15,0,192316,-66723.850000000006,null,8014.7,11251,-3236.3,null,133606.85,203567,-69960.149999999994]
[1002,10132,"Moss Hall",302766.64,0,275577,27189.640000000014,null,10046,9914,132,null,312812.64,285491,27321.640000000014]
[1003,10133,"St Margarets",29080.69000000001,0,131617,-102536.31,null,1054.8499999999999,6125,-5070.1499999999996,null,30135.540000000008,137742,-107606.45999999999]
[]
[null,null,"Sub Total - Nursery Sector",{"$f":"SUM(D5:D8)","v":615901.15},{"$f":"SUM(E5:E8)","v":0},{"$f":"SUM(F5:F8)","v":744869},{"$f":"SUM(G5:G8)","v":-128967.84999999998},null,{"$f":"SUM(I5:I8)","v":19116.8},27291,-8174.2,0,635017.95000000007,772160,-137142.04999999996]
{"$rows_left_out":107}
{"sheet":"check INTEGRA","index":3,"n_rows":102,"n_cols":28,"rows_kept":102,"cut":false,"hidden":false,"merged":[[0,25,0,27]]}
[null,null,null,null,null,null,null,null,null,null,null,null,null,null,"IN YR INCOME",null,null,null,null,"IN YR EXP",null,null,null,null,null,"PAYROLL  "]
[null,"Transactions Totals",null,null,null,null,null,null,null,null,null,null,null,null,"CFR Inc + cap",null,null,null,null,"CFR Exp + cap","Rev Bal",null,"Cap Bal",null,null,"Payroll (E01-E08)","E31","Total"]
[null,null,null,null,null,null,null,null,null,null,null,null,null,null,"bal bfd",null,null,null,null,"bal bfwd"]
[null,null,null,null,"School","Transactions","Report Total","Non CFR Adj",null,null," ",null,null,null,"A",null,null,null,null,"B","C",null,"D"]
[null,1,2,3,4,5,6,7,8,9,10,11,12,13,14,15,16,17,18,19,20,21,22,23,24,25,26,27]
[null,10130,"10130 Total","Total","Brookhill Nursery",-157404.34,-157404.34,0,null,null,-658839.03,-658839.03,-5830.25,-5830.25,-664669.28,645736.36,645736.36,5830,5830,651566.36,158461.67000000001,1.25,1.25,145359,null,561530.7699999999,0,{"$f":"SUM(Z6:AA6)","v":561530.7699999999}]
[null,10131,"10131 Total","Total","Hampden Way Nursery ",-90643.75,-90643.75,0,null,null,-788271.22,-788271.22,-4580.5,-4580.5,-792851.72,854995.07,854995.07,7816.8,7816.8,862811.87,125592.15,8014.7,8014.7,192316,null,575286.46000000008,141738.51,{"$f":"SUM(Z7:AA7)","v":717024.97000000009}]
[null,10132,"10132 Total","Total","Moss Hall Nursery",-16386.770000000015,-16386.77,0,null,null,-728156.56,-728156.56,-5053,-5053,-733209.56,700966.92,700966.92,4921,4921,705887.92,302766.64,10046,10046,275577,null,616881.96999999986,0,616881.96999999986]
[null,10133,"10133 Total","Total","St Margaret's Nursery ",85008.01,85008.01,0,null,null,-770265.07,-770265.07,-24850.25,-24850.25,-795115.32,872801.38,872801.38,29920.400000000001,29920.400000000001,902721.78,29080.69000000001,1054.8499999999999,1054.8499999999999,131617,null,727454.83,0,727454.83]
[null,10159,"10159 Total","Total","Mapledown",-28522.959999999915,-28522.959999999999,-8.3673512563109398E-11,null,null,-2533571.36,-2533571.36,-6463.75,-6463.75,-2540035.11,2574298.91,2574298.91,0,0,2574298.91,77439.449999999852,6463.75,6463.75,118167,null,2281769.2800000003,0,2281769.2800000003]
{"$rows_left_out":93}
{"sheet":"Allocation of spring claim","index":4,"n_rows":74,"n_cols":24,"rows_kept":74,"cut":false,"hidden":false,"merged":[]}
[]
[null,null,1,2,3,4,5,6,7,8]
[null,"Sum of Total Claim",null,"Type",null,null,null,null,null,null,null,null,1,2,3,4,5,null,1,2,3,4,5,6]
[null,"School","Cost Centre","LTS","MAT","MTS","Grand Total","less MTS Pool Clawback","Add LTS-MAT Pool Rebate 16-17","Total Amount Due",null,null,"Document Ref",null,null,"Amount ","Amount ",null,"CC","GL","Line Narrative","GL Code","Value","Dr / Cr Ind"]
[null,"Akiva",11094,null,12982.84,null,{"$f":"SUM(D5:F5)","v":12982.84},0,{"$f":"VLOOKUP(C5,$S$4:$X$74,5,0)","v":691.32},{"$f":"G5-H5+I5","v":13674.16},null,null,"Integra G/L Account","GL","Descritpion","Debit","Credit",null,11094,138110,"LTS-MAT Pool Rebate 16-17","11094138110",691.32,"C"]
[null,"All Saints N20",10042,504.25,null,1073,1577.25,{"$f":"VLOOKUP(C6,$M$6:$Q$60,4,0)","v":319.26},{"$f":"VLOOKUP(C6,$S$4:$X$74,5,0)","v":391.75},{"$f":"G6-H6+I6","v":1649.74},null,null,10040,138110,"MTS Pool Clawback 16-17",315.77999999999997,0,null,10040,138110,"LTS-MAT Pool Rebate 16-17","10040138110",387.48,"C"]
[null,"Annunciation Junior",10117,5397.6,null,null,5397.6,0,312.38,5709.9800000000005,null,null,10042,138110,"MTS Pool Clawback 16-17",319.26,0,null,10042,138110,"LTS-MAT Pool Rebate 16-17","10042138110",391.75,"C"]
[null,"Barnfield",10044,null,3114,null,3114,902.27,1107.1400000000001,3318.87,null,null,10044,138110,"MTS Pool Clawback 16-17",902.27,0,null,10117,138110,"LTS-MAT Pool Rebate 16-17","10117138110",312.38,"C"]
[null,"Beis Yaakov",10128,346,2595,4199.13,7140.13,510.95,626.97,7256.1500000000005,null,null,10128,138110,"MTS Pool Clawback 16-17",510.95,0,null,10044,138110,"LTS-MAT Pool Rebate 16-17","10044138110",1107.1400000000001,"C"]
[null,"Bell Lane CC",10045,1445.8600000000001,null,null,1445.8600000000001,0,754.14,2200,null,null,10047,138110,"MTS Pool Clawback 16-17",401.89,0,null,10128,138110,"LTS-MAT Pool Rebate 16-17","10128138110",626.97,"C"]
{"$rows_left_out":65}
{"sheet":"FUNDING I01 I02 I03","index":5,"n_rows":102,"n_cols":10,"rows_kept":102,"cut":false,"hidden":false,"merged":[]}
["CFR","(Multiple Items)"]
[null,null,1,2,3,4,5,6]
["Sum of Funding",null,null,null,"Original","Total","Total ","20% Orig B/share",null,"Funding "]
[null,null,null,null,"Budget","Funding","Budget","Paid to Local ",null,"deposited in "]
["DFE","School","SchoolCC","Option","Share","Adjustments","Share","Bank Account",null,"central a/c"]
[3023300,"All Saints' CE Primary School NW2",10040,"A",1048383.35,-1664.25,{"$f":"SUM(E6:F6)","v":1046719.1},{"$f":"VLOOKUP(C6,'FUNDING ALLOCATION'!$B$10:$T$105,19,0)","v":209676.66999999993},0.2,{"$f":"G6-H6","v":837042.43}]
[3023317,"All Saints' CE Primary School, N20",10042,"A",1149968.9000000004,-12903.550000000003,1137065.3500000003,{"$f":"VLOOKUP(C7,'FUNDING ALLOCATION'!$B$10:$T$105,19,0)","v":229993.78000000003},0.2,{"$f":"G7-H7","v":907071.5700000003}]
[3023500,"Annunciation Catholic Infant School",10043,"A",878388.65999999992,10324.91,888713.57,{"$f":"VLOOKUP(C8,'FUNDING ALLOCATION'!$B$10:$T$105,19,0)","v":175677.73199999996},0.2,713035.83799999999]
[3023514,"Annunciation Catholic Junior School",10117,"A",1026329.28,-15841.5,1010487.78,{"$f":"VLOOKUP(C9,'FUNDING ALLOCATION'!$B$10:$T$105,19,0)","v":205265.85599999991},0.2,805221.92400000012]
[3022079,"Beis Yaakov",10128,"A",1825635.51,-1425.2699999999995,1824210.24,{"$f":"VLOOKUP(C10,'FUNDING ALLOCATION'!$B$10:$T$105,19,0)","v":216048.51},0.2,1608161.73]
{"$rows_left_out":93}
{"sheet":"FUNDING ALLOCATION","index":6,"n_rows":106,"n_cols":28,"rows_kept":106,"cut":false,"hidden":false,"merged":[]}
[null,"Banking & Funding Option A"]
[null,"Financial Year 2016-17"]
[]
[1,2,3,4,5,6,6,7,8,9,10,11,12,13,14,15,16,17,18,19,null,null,null,20,21,22,23,24]
[null,null,null,1,null,2,3,4,5,6,7,8,9,10,11,12,13,14,15,16,null,null,null,17,18,19]
[null,null,null,null,null,"[A]",null,null,null,null,null,null,null,null,null,null,null,"[B]",null,null,null,null,null,"Addit'l Paym't"]
["Index","Cost","DCFS","School","Option","Original","I01","I01","I02","I02","I03","I03","Total",null,null,null,null,"% deemed to be Staffing ","[A] minus [B]","% of Orig B/share",null,null,null,"to Local Bank","Interim","Net Funding"]
["Ref","Centre","No.",null,null,"Budget Share","%","Amt (£)","%","Amt (£)","%","Amt (£)","I01-I03",0.1,null,null,null,"Costs & paid into ",null,"Paid to Local ",null,null,null,"A/C re Revised","Payments /","Advances"]
[null,null,null,null,null,null,543970,null,543971,null,543972,null,null,null,null,null,null,"Central Sal A/c",null,"Bank Account",null,null,null,"Budget Share","(repayment)","in year"]
[1,10040,3300,"All Saints' CE School (NW2)","A",{"$f":"VLOOKUP(B10,'[57]2016-17 CFR'!D$1:R$65536,7,0)","v":1048383.35},{"$f":"VLOOKUP(C10,[58]budget!$A$12:$P$98,9,0)","v":0.80017903182943484},{"$f":"(G10*F10)-T10","v":629217.70398909959},{"$f":"VLOOKUP(C10,[58]budget!$A$12:$P$98,11,0)","v":0},{"$f":"I10*F10","v":0},{"$f":"VLOOKUP(C10,[58]budget!$A$12:$P$98,15,0)","v":0.19982096817056511},{"$f":"K10*F10","v":209488.9760109004},{"$f":"H10+J10+L10","v":838706.67999999993},{"$f":"F10-M10","v":209676.67000000004},{"$f":"G10+I10+K10","v":1},{"$f":"M10-R10","v":0},{"$f":"N10-S10","v":0},{"$f":"+F10/100*80","v":838706.68},{"$f":"+F10-R10","v":209676.66999999993},{"$f":"S10","v":209676.66999999993},null,null,null,null,null,{"$f":"T10+X10+Y10","v":209676.66999999993},null,{"$f":"G10+I10+K10","v":1}]
{"$rows_left_out":97}
{"sheet":"early retirement","index":7,"n_rows":4790,"n_cols":6,"rows_kept":4790,"cut":false,"hidden":false,"merged":[[4789,0,4789,5],[8,0,8,5],[9,0,9,5],[10,0,10,5],[11,4,11,5],[4785,0,4785,2],[4788,0,4788,5],[1,0,1,5],[2,0,2,5],[4,0,4,5],[5,0,5,5],[6,0,6,5],[7,0,7,5]]}
[]
[""]
[""]
[]
[]
["Integra Finance System LBB - LIVE"]
[""]
["LBB Hierachy 1 (LBB_COM)"]
["Year to period 12"]
[""]
{"$rows_left_out":4781}
{"sheet":"CFR VAL","index":8,"n_rows":178,"n_cols":65,"rows_kept":178,"cut":false,"hidden":false,"merged":[]}
[null,1,2,3,4,5,6,7,8,9,10,11,12,13,14,15,16,17,18,19,20,21,22,23,24,25,26,27,28,29,30,31,32,33,34,35,36,37,38,39,40,41,42,43,44,45,46,47,48,49,50,51,52,53,54,55,56,57,58,59,60,61,62,63,64]
["DFE","Cost Centre","School","I01 ","I02 ","I03 ","I04 ","I05 ","I06 ","I07 ","I08 ","I09 ","I10 ","I11 ","I12 ","I13 ","I15 ","I16 ","I17 ","I18 ","E01 ","E02 ","E03 ","E04 ","E05 ","E06 ","E07 ","E08 ","E09 ","E10 ","E11 ","E31 ","E12 ","E13 ","E14 ","E15 ","E16 ","E17 ","E18 ","E19 ","E20 ","E21 ","E22 ","E23 ","E24 ","E25 ","E29 ","E32 ","E26 ","E27 ","E28 ","Cont","E30 ","CI01","CI03","CI04","CE01","CE02","CE03","CE04",null,"E01 to E07","Redundancy","Total E01 to E07 + redundancy","E31"]
[3520,11094,"Akiva",-1578706,0,-75489,0,-4950,-55963.58,-17078.63,-12362.14,-80233.14,-14013,-3986.84,-55382.84,-400302.09,0,0,0,-105233.92,1039369.93,11604.58,380759.76,35982.18,131230.96,0,11667.12,3925.27,5276.56,13707.29,0,0,24722.71,9542.4599999999991,39046.199999999997,4915.51,23207.279999999999,0,134231.98000000001,106628.25,18607.73,0,11486.14,29083.63,1781.2,141203.34,0,0,89065.16,60139.53,52458.09,0,68008.850000000006,0,0,-68008.850000000006,0,0,0,24764.85,null,{"$f":"SUM(U3:AA3)","v":1610614.53},null,{"$f":"SUM(BJ3:BK3)","v":1610614.53},0]
[3317,10042,"All Saints N20",-1109380,0,-27686,0,-76240,-4001.9,-6809.76,-31149.49,-35874.33,-14013,-1577.25,-28737.15,-13012.18,0,0,0,-48881.25,542198.88,14120.69,262323.69,26690.28,45861.51,0,26286.34,5977.12,6254.67,9848.5,2957.67,0,57542.91,4809.53,30104.17,4233.01,17274.04,0,6854.96,52019.23,21473.59,0,12545.08,4451.5,7594.33,70820.38,0,0,73575.520000000004,53824.14,21228.22,0,0,0,0,0,0,0,0,0,null,{"$f":"SUM(U4:AA4)","v":917481.39},null,{"$f":"SUM(BJ4:BK4)","v":917481.39},0]
[3300,10040,"All Saints NW2",-1001991,0,-44729,0,-117713,-1000,-2500,-1383.15,-17787.599999999999,0,0,-20326.68,-10740.27,0,0,0,-33234.32,555751.69999999995,3.69,250155.98,30114.09,33776.660000000003,0,11227.84,5663.93,7785.82,9699.06,0,0,10908.85,1343.83,15003.23,5527.51,12357.78,0,4647.45,53521.25,12976.69,0,12952.82,5285.19,2058.64,53680.76,0,0,17116.400000000001,56133.35,31340.2,0,0,0,0,0,0,0,0,0,null,881029.95999999985,null,881029.95999999985,0]
[3500,10043,"Annunciation Inf",-876710,0,-12003,0,-34320,0,-275,-4850.1499999999996,0,0,0,0,0,0,0,0,-65478.75,607502.75,0,183671.1,12895.38,36464.25,0,-405,2351.89,3052,282.2,994.5,0,10205.790000000001,0,2494.83,1491.99,7826.87,0,3847.71,7961.23,10546.37,0,4956.3900000000003,5904.76,2054.9499999999998,68312.179999999993,0,0,0,11102.96,13459.400000000001,0,0,0,0,0,0,0,0,0,null,840128.48,null,840128.48,0]
[3514,10117,"Annunciation Jun",-982368.33,0,-28118,0,-64679.95,-1150,-5425,-7610.55,-36139.730000000003,-12265.7,0,-12013.35,-297.75,0,0,0,-9128.94,578352.43000000005,0,148895.48000000001,42591.71,29769.22,0,2880.48,7670.75,6827.75,6253.02,1003.5,0,8845.06,1985.17,1654.34,959.77,9379.65,0,3594.17,36963.410000000003,14156.76,0,5592.31,6317.4,14500.04,44787.55,0,0,86430.720000000001,35331.33,33723,0,0,0,0,0,0,0,0,0,null,802489.32,null,802489.32,0]
[2002,10044,"Barnfield",-2434814,0,-92660.86,0,-406320,-17395.5,0,-40562.99,-36516.559999999998,-12629,0,-20762.45,-4561.1099999999997,0,-263772,420,-48022.95,1283871.26,0,705703.55,31986.21,51871.24,0,104518.53,16438.830000000002,13711.45,16743.27,12904.66,262629.86,53831.47,0,71367.12,2880.12,32899.21,26092.5,14900.12,127995.63,29204.49,0,33625.839999999997,12790.55,25549.37,109797.27,0,55169.55,63340.5,180437.85,23580.73,0,25431,-9802.75,0,-25431,0,9270,0,25963.82,null,2177950.79,null,2177950.79,262629.86]
[2079,10128,"Beis Yaakov",-1868746.11,0,-10129,0,-67320,-1600,0,0,-24306.99,-20132.400000000001,0,-7965.77,-46000,0,0,0,-78259.94,1288528.4099999999,1939.86,105400.39,23825.85,95591.81,0,78826.039999999994,20312.509999999998,1661.98,15880.93,0,0,18070.62,0,48022.92,3999.93,23037.53,14372.6,13524.41,48429.65,22822.69,0,16781.78,0,9098.08,106662.42,0,0,595,25169.98,42361.86,0,0,0,0,0,0,0,0,0,null,1594112.36,null,1594112.36,0]
[3524,11278,"Beit Shvidler School",-932777.16,0,-87178,0,-25080,-44081,-1725,-66594.740000000005,-14641.96,0,0,-22230.05,-199199.16,0,0,0,-45344.08,616222.05000000005,286.75,266835.94,10469.969999999999,81244.58,0,0,16264.19,8012.75,346.94,5105.0600000000004,0,36649,7126.98,45275.33,4406.66,13869.99,0,52028.73,72149.64,13260.02,0,6389.49,11234.01,3388.67,54524,0,0,86747.44,23575.200000000001,45418.19,0,0,0,0,0,0,0,0,0,null,975059.28999999992,null,975059.28999999992,0]
{"$rows_left_out":169}
{"sheet":"Sheet1","index":9,"n_rows":0,"n_cols":0,"rows_kept":0,"cut":false,"hidden":false,"merged":[]}