{"text_format":"1","workbook":"xlsx","n_sheets":10,"sheets":["Front Page","OUTTURN STATEMENT","Indschls 17-18","I01 I02 I03 FUNDING 2017-18","Payment Schedule","Integra Salaries A to C Summary","In year Outturn","In year Income & Expenditure","spring term summary","Sept 2017"],"not_rendered":{"charts":0,"images":1,"macros":1,"external_links":70,"defined_names":3038,"comments":4,"pivot_tables":0},"unopened":[],"bounds":{"document_bytes":16777216,"sheet_cells":100000,"rows_first":2000,"rows_last":500,"rows_between":2000,"halvings":0,"cell_chars":16384,"cell_head_chars":4096},"cells_cut":0,"cells_raw":0,"read":"whole","date_system":"1900"}

{"sheet":"Front Page","index":0,"n_rows":97,"n_cols":25,"rows_kept":97,"cut":false,"hidden":false,"merged":[[8,3,9,3],[8,5,9,5]]}
[null,null,null,null,null,null,null,null,null,null,null,null,null,null,null,null,null,null,null,null,null,null,null,"Choose your school"]
[null,null,null,null,null,null,null,null,null,null,null,null,null,null,null,null,null,null,null,null,null,null,null,"Akiva",3520]
[null,null,null,null,null,null,null,null,null,null,null,null,null,null,null,null,null,null,null,null,null,null,null,"All Saints' CE School (N20)",3317]
[null,null,null,null,null,null,null,null,null,null,null,null,null,null,null,null,null,null,null,null,null,null,null,"All Saints' CE School (NW2)",3300]
[null,null,null,null,null,null,null,null,null,null,null,null,null,null,null,null,null,null,null,null,null,null,null,"Annunciation RC Infant School",3500]
[null,null,null,null,null,null,null,null,null,null,null,null,null,null,null,null,null,null,null,null,null,null,null,"Annunciation RC Junior School",3514]
[null,null,null,"2017-18 FINAL OUTTURN STATEMENTS",null,null,null,null,null,null,null,null,null,null,null,null,null,null,null,null,null,null,null,"Barnfield School",2002]
[null,null,null,null,null,null,null,null,null,null,null,null,null,null,null,null,null,null,null,null,null,null,null,"Beis Yaakov",2079]
[null,null,null,"Choose your school",null,{"$f":"VLOOKUP(D9,X:Y,2,0)","v":0},null,null,null,null,null,null,null,null,null,null,null,null,null,null,null,null,null,"Beit Shvidler",3524]
[null,null,null,null,null,null,null,null,null,null,null,null,null,null,null,null,null,null,null,null,null,null,null,"Bell Lane School",2003]
[null,null,null,null,null,null,null,null,null,null,null,null,null,null,null,null,null,null,null,null,null,null,null,"Blessed Dominic RC School",3511]
[null,null,null,null,null,null,null,null,null,null,null,null,null,null,null,null,null,null,null,null,null,null,null,"Brookhill Nursery",1000]
[null,null,null,null,null,null,null,null,null,null,null,null,null,null,null,null,null,null,null,null,null,null,null,"Brookland Infant School",2008]
[null,null,null,null,null,null,null,null,null,null,null,null,null,null,null,null,null,null,null,null,null,null,null,"Brookland Junior School",2007]
[null,null,null,null,null,null,null,null,null,null,null,null,null,null,null,null,null,null,null,null,null,null,null,"Brunswick Park School",2009]
{"$rows_left_out":83}
{"sheet":"OUTTURN STATEMENT","index":1,"n_rows":165,"n_cols":5,"rows_kept":165,"cut":false,"hidden":false,"merged":[[4,1,4,4],[4,7,4,9],[5,1,5,4],[6,1,6,4],[30,8,30,9],[37,8,37,9],[38,8,38,9],[31,8,31,9],[33,8,33,9],[34,8,34,9],[35,8,35,9],[36,8,36,9]]}
[]
[]
[null,null,null,null,{"$f":"'Front Page'!$F$9","v":0}]
[]
[null,"London Borough of Barnet"]
[null,"Summary of Final Outturn Position &"]
[null,"Statement of Central / Salary Account FY 2017-18"]
[null,null,null,"Option ",{"$f":"VLOOKUP($E$9,'I01 I02 I03 FUNDING 2017-18'!$B$3:$L$94,2,FALSE)","v":{"$error":"#N/A"}}]
[null,{"$f":"VLOOKUP(E10,A62:B169,2,0)","v":{"$error":"#N/A"}},null,"Cost Centre",{"$f":"VLOOKUP(E10,A:C,3,0)","v":{"$error":"#N/A"}}]
[null,null,null,"DfE No",{"$f":"'Front Page'!$F$9","v":0}]
[]
[null,"Summary","£","£","£"]
[]
[null,"In year Income",{"$f":"VLOOKUP($E$9,'In year Outturn'!$A$4:$F$96,4,0)","v":{"$error":"#N/A"}}]
[null,"In year Expenditure",{"$f":"VLOOKUP($E$9,'In year Outturn'!$A$4:$F$96,5,0)","v":{"$error":"#N/A"}}]
{"$rows_left_out":151}
{"sheet":"Indschls 17-18","index":2,"n_rows":132,"n_cols":15,"rows_kept":132,"cut":false,"hidden":false,"merged":[[1,2,1,14],[2,4,2,6],[2,9,2,10],[2,13,2,14]]}
[null,1,2,3,4,5,6,7,8,9,10,11,12,13,14]
[null,null,"Final Individual School Outturn Balances 2017-18"]
[null,null,null,"Rev","Revenue",null,null,null,"Cap","Capital",null,null,null,"Total Balance"]
[null,null,"School","As at 31.03.18","As at 31.03.17","Balance as % Final Budget Share 17-18","Increase / (decrease)",null,"As at 31.03.18",{"$f":"E4","v":"As at 31.03.17"},"Increase / (decrease)",null,"As at 31.03.18",{"$f":"E4","v":"As at 31.03.17"},"Increase / (decrease)"]
[1000,10130,"Brookhill",{"$f":"[64]Brk!$H$66","v":156379.92000000001},{"$f":"VLOOKUP(B5,[65]EOY!$A$3:$F$99,4,0)","v":158461.67000000001},0,{"$f":"D5-E5","v":-2081.75},null,{"$f":"[64]Brk!$H$76","v":4720.55},{"$f":"VLOOKUP(B5,[65]EOY!$A$3:$F$99,6,0)","v":1.25},{"$f":"I5-J5","v":4719.3},null,{"$f":"D5+I5","v":161100.47},{"$f":"E5+J5","v":158462.92000000001},{"$f":"M5-N5","v":2637.5499999999884}]
[1001,10131,"Hampden Way",{"$f":"[64]Hmp!$H$70","v":168833.62},{"$f":"VLOOKUP(B6,[65]EOY!$A$3:$F$99,4,0)","v":125592.15},0,{"$f":"D6-E6","v":43241.47},null,{"$f":"[64]Hmp!$H$81","v":3841.38},{"$f":"VLOOKUP(B6,[65]EOY!$A$3:$F$99,6,0)","v":8014.7},{"$f":"I6-J6","v":-4173.32},null,{"$f":"D6+I6","v":172675},{"$f":"E6+J6","v":133606.85},{"$f":"M6-N6","v":39068.149999999994}]
[1002,10132,"Moss Hall",{"$f":"[64]MHN!$H$70","v":304596.52},{"$f":"VLOOKUP(B7,[65]EOY!$A$3:$F$99,4,0)","v":302766.64},0,{"$f":"D7-E7","v":1829.8800000000047},null,{"$f":"[64]MHN!$H$81","v":9136.26},{"$f":"VLOOKUP(B7,[65]EOY!$A$3:$F$99,6,0)","v":10046},{"$f":"I7-J7","v":-909.73999999999978},null,313732.78000000003,{"$f":"E7+J7","v":312812.64},{"$f":"M7-N7","v":920.14000000001397}]
[1003,10133,"St Margarets",{"$f":"[64]StM!$H$67","v":14131.35},{"$f":"VLOOKUP(B8,[65]EOY!$A$3:$F$99,4,0)","v":29080.69000000001},0,{"$f":"D8-E8","v":-14949.340000000009},null,{"$f":"[64]StM!$H$79","v":5855.55},{"$f":"VLOOKUP(B8,[65]EOY!$A$3:$F$99,6,0)","v":1054.8499999999999},{"$f":"I8-J8","v":4800.7000000000007},null,19986.900000000001,{"$f":"E8+J8","v":30135.540000000008},{"$f":"M8-N8","v":-10148.640000000007}]
[]
[null,null,"Sub Total - Nursery Sector",{"$f":"SUM(D5:D8)","v":643941.41},{"$f":"SUM(E5:E8)","v":615901.15},{"$f":"SUM(F5:F8)","v":0},{"$f":"SUM(G5:G8)","v":28040.259999999995},null,{"$f":"SUM(I5:I8)","v":23553.74},{"$f":"SUM(J5:J8)","v":19116.8},4436.9400000000014,0,667495.15,635017.95000000007,32477.19999999999]
[]
[3520,11094,"Akiva",{"$f":"[64]Akv!$H$72","v":37544.599999999984},{"$f":"VLOOKUP(B12,[65]EOY!$A$3:$F$99,4,0)","v":-34411.530000000035},0,{"$f":"D12-E12","v":71956.130000000019},null,0,{"$f":"VLOOKUP(B12,[65]EOY!$A$3:$F$99,6,0)","v":9.3132257461547854E-12},{"$f":"I12-J12","v":-9.3132257461547854E-12},null,{"$f":"D12+I12","v":37544.599999999984},-34411.530000000028,{"$f":"M12-N12","v":71956.13}]
[3317,10042,"All Saints' CE School (N20)",{"$f":"[64]AstN20!$H$72","v":123256.73},{"$f":"VLOOKUP(B13,[65]EOY!$A$3:$F$99,4,0)","v":151873.35},0,-28616.62000000001,null,{"$f":"[64]AstN20!$H$83","v":0},{"$f":"VLOOKUP(B13,[65]EOY!$A$3:$F$99,6,0)","v":0},0,null,123256.73,151873.35,-28616.62000000001]
[3300,10040,"All Saints' CE School (NW2)",{"$f":"[64]AstNW2!$H$71","v":106584.36},{"$f":"VLOOKUP(B14,[65]EOY!$A$3:$F$99,4,0)","v":205150.3},0,-98565.939999999988,null,{"$f":"[64]AstNW2!$H$81","v":0},{"$f":"VLOOKUP(B14,[65]EOY!$A$3:$F$99,6,0)","v":0},0,null,106584.36,205150.3,-98565.939999999988]
[3500,10043,"Annunciation RC Infant School",{"$f":"[64]AnnI!$H$65","v":175894.23},{"$f":"VLOOKUP(B15,[65]EOY!$A$3:$F$99,4,0)","v":122676.40000000004},0,53217.829999999973,null,0,{"$f":"VLOOKUP(B15,[65]EOY!$A$3:$F$99,6,0)","v":0},0,null,175894.23,122676.40000000004,53217.829999999973]
{"$rows_left_out":118}
{"sheet":"I01 I02 I03 FUNDING 2017-18","index":3,"n_rows":95,"n_cols":12,"rows_kept":95,"cut":false,"hidden":false,"merged":[]}
["Sum of Funding",1,2,3,4,5,6,7,8,9,10,11]
["DfE Number","SchoolCC","Option","School","I01","I01 convert","I02","I03","I03 convert","Total Funding","Local Bank A/c","Central Salaries A/c"]
[3023300,10040,"A","All Saints' CE Primary School NW2",994420.92,null,null,52047,null,{"$f":"SUM(E3:I3)","v":1046467.92},207856,{"$f":"J3-K3","v":838611.92}]
[3023317,10042,"A","All Saints' CE Primary School, N20",1173646.22,null,null,30922.16,null,{"$f":"SUM(E4:I4)","v":1204568.3799999999},236637,{"$f":"J4-K4","v":967931.37999999989}]
[3023500,10043,"A","Annunciation Catholic Infant School",938213.79999999993,null,null,16547.25,null,954761.04999999993,189388,765373.04999999993]
[3023514,10117,"A","Annunciation Catholic Junior School",978153.19,null,null,22518.42,null,1000671.61,201254,799417.61]
[3022079,10128,"A","Beis Yaakov",1905651.57,null,null,8137.0000000000018,null,1913788.57,273034,1640754.57]
[3022003,10045,"A","Bell Lane Primary School",1988869.0799999998,null,null,61867,null,2050736.0799999998,408677,1642059.0799999998]
[3023511,10115,"A","Blessed Dominic School",1988263.23,null,null,105762.17,null,2094025.4,417842,1676183.4]
[3021000,10130,"A","Brookhill Nursery",392473.23999999993,null,null,6769.29,null,399242.52999999991,64487,334755.52999999991]
[3022008,10047,"A","Brookland Infant  & Nursery School",1312512.5800000003,null,null,87537.600000000006,null,1400050.1800000004,278032,1122018.1800000004]
[3022007,10046,"A","Brookland Junior School",1440569.9000000001,null,null,72905.08,null,1513474.9800000002,303585,1209889.9800000002]
[3022009,10048,"A","Brunswick Park Primary & Nursery School",1978601.61,null,null,64337.15,null,2042938.76,395677,1647261.76]
[3022067,10118,"A","Chalgrove Primary School",1180556.7699999998,null,null,50300.5,null,1230857.2699999998,243746,987111.26999999979]
[3022010,10049,"A","Child's Hill School",1825375.69,null,null,297959.17,null,2123334.86,428681,1694653.8599999999]
{"$rows_left_out":81}
{"sheet":"Payment Schedule","index":4,"n_rows":185,"n_cols":9,"rows_kept":185,"cut":false,"hidden":false,"merged":[[0,2,0,6]]}
[null,null,"DETAILS OF SCHOOL BANK ACCOUNT FUNDING"]
[]
[null,null,null,"OPTION A SCHOOLS",null,"YEAR 2017/2018"]
[]
[null,null,"PAYMENTS TO BE PAID TO SCHOOLS ON ",null,"  Monday 3rd April 2017"]
[]
[null,null,"DATE","PAYMENT","INTERNAL",null,"EXTERNAL "]
[null,null,null,"REF","REF",null,"DESCRIPTION"]
[]
[null,null,{"$f":"NOW()","v":"2018-05-24T15:07:43.530"},"April Funding","OPTION A",null,"April Funding"]
[null,1,2,3,4,5,6]
[null,null,"SCHOOL","VENDOR NO.","GL CODE","COST CENTRE","PAYMENT DUE £","Document No."]
["A",3300,"All Saints' CE School (NW2)","400069",543965,"10162",207856]
["A",3317,"All Saints' CE School (N20)","400015",543965,"10162",236637]
["A",3514,"Annunciation RC Junior ","400107",543965,"10162",201254]
{"$rows_left_out":171}
{"sheet":"Integra Salaries A to C Summary","index":5,"n_rows":75,"n_cols":4,"rows_kept":75,"cut":false,"hidden":false,"merged":[]}
[]
[1,2,3,4]
["Sum of Actual"]
["Profit Centre","School","Option","Total"]
[10040,"All Saints' CE NW2","A",852024.02000000014]
[10042,"All Saints' CE N20","A",1054040.02]
[10043,"Annunciation RC Infant","A",862983.26]
[10045,"Bell Lane School","A",1740532.3699999996]
[10046,"Brookland Junior School","A",1375115.9100000004]
[10047,"Brookland Infant School","A",1090887.44]
[10048,"Brunswick Park School","A",1725623.2200000002]
[10049,"Childs Hill School","A",1985840.2100000002]
[10051,"Church Hill School","A",903758.20000000007]
[10054,"Colindale School","A",2858616.4800000009]
[10055,"Coppetts Wood School","A",1442105.06]
{"$rows_left_out":61}
{"sheet":"In year Outturn","index":6,"n_rows":97,"n_cols":6,"rows_kept":97,"cut":false,"hidden":false,"merged":[]}
[1,2,3,4,5,6]
[null,null,null,"Total in year","Total in year","In-year "]
["CC","DfE No","School","Income","Revenue","Outturn"]
[10040,{"$f":"VLOOKUP(A4,'[70]April 2018'!$E$5:$F$101,2,0)","v":3300},"All Saints' CE NW2",-1269147.22,1367712.86,{"$f":"SUM(D4:E4)","v":98565.64000000013}]
[10042,{"$f":"VLOOKUP(A5,'[70]April 2018'!$E$5:$F$101,2,0)","v":3317},"All Saints' CE N20",-1492557.03,1521173.3000000005,{"$f":"SUM(D5:E5)","v":28616.270000000484}]
[10043,{"$f":"VLOOKUP(A6,'[70]April 2018'!$E$5:$F$101,2,0)","v":3500},"Annunciation RC Infant",-1074299.5,1021081.2699999997,-53218.230000000331]
[10044,{"$f":"VLOOKUP(A7,'[70]April 2018'!$E$5:$F$101,2,0)","v":2002},"Barnfield School",-3307746.8799999994,2999821.0200000005,-307925.85999999894]
[10045,{"$f":"VLOOKUP(A8,'[70]April 2018'!$E$5:$F$101,2,0)","v":2003},"Bell Lane School",-2744250.4800000009,2498050.8199999998,-246199.66000000108]
[10046,{"$f":"VLOOKUP(A9,'[70]April 2018'!$E$5:$F$101,2,0)","v":2007},"Brookland Junior School",-1882407.7399999998,1910755.52,28347.780000000261]
[10047,{"$f":"VLOOKUP(A10,'[70]April 2018'!$E$5:$F$101,2,0)","v":2008},"Brookland Infant School",-1711525.8099999998,1634842.9100000004,-76682.899999999441]
[10048,{"$f":"VLOOKUP(A11,'[70]April 2018'!$E$5:$F$101,2,0)","v":2009},"Brunswick Park School",-2624717.4500000007,2477642.3199999998,-147075.13000000082]
[10049,{"$f":"VLOOKUP(A12,'[70]April 2018'!$E$5:$F$101,2,0)","v":2010},"Childs Hill School",-2644150.61,2677052.0700000003,32901.460000000428]
[10050,{"$f":"VLOOKUP(A13,'[70]April 2018'!$E$5:$F$101,2,0)","v":3302},"Christ Church CE School",-1241995.02,1155290.96,-86704.060000000056]
[10051,{"$f":"VLOOKUP(A14,'[70]April 2018'!$E$5:$F$101,2,0)","v":2011},"Church Hill School",-1247168.58,1264689.0200000003,17520.440000000177]
[10054,{"$f":"VLOOKUP(A15,'[70]April 2018'!$E$5:$F$101,2,0)","v":2014},"Colindale School",-4193505.48,4383836.66,190331.18000000017]
{"$rows_left_out":83}
{"sheet":"In year Income & Expenditure","index":7,"n_rows":99,"n_cols":20,"rows_kept":99,"cut":false,"hidden":false,"merged":[]}
[1,2,3,4,5,6,7,8,9,10,11,12,13,14,15,16,17,18,19,20]
["Transactions Totals",null,null,null,null,null,null,null,null,null,"CFR Inc + cap",null,null,null,null,"CFR Exp + cap","Rev Bal",null,"Cap Bal"]
[null,null,null,null,null,null,null,null,null,null,"bal bfd",null,null,null,null,null,null,null,null,"bal bfwd"]
[null,"School","Transactions","Report Total",null,null," ",null,null,null,"A",null,null,null,null,"B","C",null,"D"]
[null,null,"£","£",null,null,"in yr rev income",null,"in yr cap income",null,"total in yr income","in yr rev exp",null,"in yr cap exp",null,"total in yr exp"]
[10130,"Brookhill Nursery",-61725.909999999982,-61725.91,null,null,-709705.4,-709705.4,-4719.55,-4719.55,{"$f":"G6+I6","v":-714424.95000000007},711787.48,711787.48,0,0,{"$f":"L6+N6","v":711787.48},156379.92000000001,4720.55,4720.55,158462]
[10131,"Hampden Way Nursery ",-202656.53,-202656.53,null,null,-812177.07,-812177.07,-4626.38,-4626.38,{"$f":"G7+I7","v":-816803.45},768935.45,768935.45,8800,8800,{"$f":"L7+N7","v":777735.45},168833.62,3841.38,3841.38,125592]
[10132,"Moss Hall Nursery",26395.809999999983,26395.81,null,null,-677479.57,-677479.57,-5053,-5053,-682532.57,675650.05,675650.05,5962.74,5962.74,681612.79,304596.52,9136.26,9136.26,302767]
[10133,"St Margaret's Nursery ",16256.6,16256.6,null,null,-768840.97,-768840.97,-34385.550000000003,-34385.550000000003,-803226.52,783790.62,783790.62,29585,29585,813375.62,14131.35,5855.55,5855.55,29081]
[10159,"Mapledown",24205.99000000002,24205.99,null,null,-2786724.21,-2786724.21,-7016.25,-7016.25,-2793740.46,2714481.51,2714481.51,13480,13480,2727961.51,149681.70000000001,0.25,0.25,77439]
[10157,"Northway",252288.69,252288.69,null,null,-2520306.61,-2520306.61,-44341.25,-44341.25,-2564647.86,2516889.0699999998,2516889.0699999998,44340.46,44340.46,2561229.5299999998,185976.53999999995,0.79,0.79,182559]
[10158,"Oakleigh",73658.520000000091,73658.52,null,null,-3894423.8,-3894423.8,-11759,-11759,-3906182.8,3883383.63,3883383.63,13549,13549,3896932.63,214291.17,0,0,203251]
[10185,"Northgate",38660.780000000013,38660.78,null,null,-522087.08,-522087.08,-4135.25,-4135.25,-526222.33000000007,552726.88,552726.88,7144.86,7144.86,559871.74,100275.2,10655.39,10655.39,130915]
[10188,"Pavilion",-29957.719999999947,-29957.72,null,null,-2608541.62,-2608541.62,-6667.56,-6667.56,-2615209.1800000002,2553398.7200000002,2553398.7200000002,9282,9282,2562680.7200000002,114164.9,8036.56,8036.56,59022]
[11094,"Akiva",44850.039999999972,44850.04,null,null,-2484864.5299999998,-2484864.5299999998,0,"0",-2484864.5299999998,2412907.9300000002,2412907.9300000002,0,"0",2412907.9300000002,37544.599999999984,{"$error":"#N/A"},0,-34412]
{"$rows_left_out":85}
{"sheet":"spring term summary","index":8,"n_rows":100,"n_cols":24,"rows_kept":100,"cut":false,"hidden":false,"merged":[[3,14,3,17]]}
[null,1,2,3,4,5,6,7,8,9,10,11,12,13,14,15,16,17,18]
["Spring Term 2018 - Summary by GL Code"]
[]
["Sum of Total Claim",null,"Type","GL Code",null,null,null,null,null,null,null,null,null,null,"Clawback"]
[null,null,"LTS",null,"LTS Total","MAT",null,"MAT Total","MTS",null,"MTS Total","(blank)","(blank) Total","Grand Total","MTS 1","MTS 2","LTS 1","LTS 2","Net payment"]
["School","Costloc",739020,739030,null,739020,739030,null,739020,739030,null,"#N/A"]
["Akiva",11094,1190,null,1190,2450,null,2450,null,null,null,null,null,3640,{"$f":"IF(ISERROR(VLOOKUP(B7,'[68]MTS clawback jnl'!$A$11:$E$76,5,0)),0,VLOOKUP(B7,'[68]MTS clawback jnl'!$A$11:$E$76,5,0))","v":0},{"$f":"IF(ISERROR(VLOOKUP(B7,'[68]MTS clawback jnl 2'!$A$11:$E$76,5,0)),0,VLOOKUP(B7,'[68]MTS clawback jnl 2'!$A$11:$E$76,5,0))","v":0},{"$f":"IF(ISERROR(VLOOKUP(B7,'[68]LTS-MAT clawback jnl'!$A$11:$F$87,5,0)),0,VLOOKUP(B7,'[68]LTS-MAT clawback jnl'!$A$11:$F$87,5,0))","v":91.67},{"$f":"IF(ISERROR(VLOOKUP(B7,'[68]LTS-MAT clawback jnl 2'!$A$11:$F$87,5,0)),0,VLOOKUP(B7,'[68]LTS-MAT clawback jnl 2'!$A$11:$F$87,5,0))","v":20.61},{"$f":"N7-O7-P7-Q7-R7","v":3527.72},null,null,{"$f":"IF(ISERROR(VLOOKUP(I12,'[68]MTS clawback jnl'!$A$11:$E$76,5,0)),0,VLOOKUP(I12,'[68]MTS clawback jnl'!$A$11:$E$76,5,0))","v":0},"Akiva",11094]
["All Saints N20",10042,2275,null,2275,null,null,null,3500,null,3500,null,null,5775,{"$f":"IF(ISERROR(VLOOKUP(B8,'[68]MTS clawback jnl'!$A$11:$E$76,5,0)),0,VLOOKUP(B8,'[68]MTS clawback jnl'!$A$11:$E$76,5,0))","v":664.87},{"$f":"IF(ISERROR(VLOOKUP(B8,'[68]MTS clawback jnl 2'!$A$11:$E$76,5,0)),0,VLOOKUP(B8,'[68]MTS clawback jnl 2'!$A$11:$E$76,5,0))","v":16.21},{"$f":"IF(ISERROR(VLOOKUP(B8,'[68]LTS-MAT clawback jnl'!$A$11:$F$87,5,0)),0,VLOOKUP(B8,'[68]LTS-MAT clawback jnl'!$A$11:$F$87,5,0))","v":58.55},{"$f":"IF(ISERROR(VLOOKUP(B8,'[68]LTS-MAT clawback jnl 2'!$A$11:$F$87,5,0)),0,VLOOKUP(B8,'[68]LTS-MAT clawback jnl 2'!$A$11:$F$87,5,0))","v":13.16},{"$f":"N8-O8-P8-Q8-R8","v":5022.21},null,null,{"$f":"IF(ISERROR(VLOOKUP(I8,'[68]MTS clawback jnl'!$A$11:$E$76,5,0)),0,VLOOKUP(I8,'[68]MTS clawback jnl'!$A$11:$E$76,5,0))","v":0},"All Saints NW2",10040]
["All Saints NW2",10040,null,558,558,8225,null,8225,null,null,null,null,null,8783,{"$f":"IF(ISERROR(VLOOKUP(B9,'[68]MTS clawback jnl'!$A$11:$E$76,5,0)),0,VLOOKUP(B9,'[68]MTS clawback jnl'!$A$11:$E$76,5,0))","v":547.82000000000005},{"$f":"IF(ISERROR(VLOOKUP(B9,'[68]MTS clawback jnl 2'!$A$11:$E$76,5,0)),0,VLOOKUP(B9,'[68]MTS clawback jnl 2'!$A$11:$E$76,5,0))","v":13.36},{"$f":"IF(ISERROR(VLOOKUP(B9,'[68]LTS-MAT clawback jnl'!$A$11:$F$87,5,0)),0,VLOOKUP(B9,'[68]LTS-MAT clawback jnl'!$A$11:$F$87,5,0))","v":48.25},{"$f":"IF(ISERROR(VLOOKUP(B9,'[68]LTS-MAT clawback jnl 2'!$A$11:$F$87,5,0)),0,VLOOKUP(B9,'[68]LTS-MAT clawback jnl 2'!$A$11:$F$87,5,0))","v":10.84},8162.73,null,null,null,"All Saints N20",10042]
["Annunciation Infant",10043,null,null,null,null,null,null,null,null,null,null,null,null,{"$f":"IF(ISERROR(VLOOKUP(B10,'[68]MTS clawback jnl'!$A$11:$E$76,5,0)),0,VLOOKUP(B10,'[68]MTS clawback jnl'!$A$11:$E$76,5,0))","v":0},{"$f":"IF(ISERROR(VLOOKUP(B10,'[68]MTS clawback jnl 2'!$A$11:$E$76,5,0)),0,VLOOKUP(B10,'[68]MTS clawback jnl 2'!$A$11:$E$76,5,0))","v":0},{"$f":"IF(ISERROR(VLOOKUP(B10,'[68]LTS-MAT clawback jnl'!$A$11:$F$87,5,0)),0,VLOOKUP(B10,'[68]LTS-MAT clawback jnl'!$A$11:$F$87,5,0))","v":0},{"$f":"IF(ISERROR(VLOOKUP(B10,'[68]LTS-MAT clawback jnl 2'!$A$11:$F$87,5,0)),0,VLOOKUP(B10,'[68]LTS-MAT clawback jnl 2'!$A$11:$F$87,5,0))","v":0},0]
["Annunciation Junior",10117,2100,null,2100,null,null,null,null,null,null,null,null,2100,{"$f":"IF(ISERROR(VLOOKUP(B11,'[68]MTS clawback jnl'!$A$11:$E$76,5,0)),0,VLOOKUP(B11,'[68]MTS clawback jnl'!$A$11:$E$76,5,0))","v":0},{"$f":"IF(ISERROR(VLOOKUP(B11,'[68]MTS clawback jnl 2'!$A$11:$E$76,5,0)),0,VLOOKUP(B11,'[68]MTS clawback jnl 2'!$A$11:$E$76,5,0))","v":0},{"$f":"IF(ISERROR(VLOOKUP(B11,'[68]LTS-MAT clawback jnl'!$A$11:$F$87,5,0)),0,VLOOKUP(B11,'[68]LTS-MAT clawback jnl'!$A$11:$F$87,5,0))","v":47.18},{"$f":"IF(ISERROR(VLOOKUP(B11,'[68]LTS-MAT clawback jnl 2'!$A$11:$F$87,5,0)),0,VLOOKUP(B11,'[68]LTS-MAT clawback jnl 2'!$A$11:$F$87,5,0))","v":10.61},2042.2100000000003,null,null,null,"Annunciation Junior",10117]
["Barnfield",10044,10150,2805.72,12955.72,null,null,null,null,null,null,null,null,12955.72,{"$f":"IF(ISERROR(VLOOKUP(B12,'[68]MTS clawback jnl'!$A$11:$E$76,5,0)),0,VLOOKUP(B12,'[68]MTS clawback jnl'!$A$11:$E$76,5,0))","v":0},{"$f":"IF(ISERROR(VLOOKUP(B12,'[68]MTS clawback jnl 2'!$A$11:$E$76,5,0)),0,VLOOKUP(B12,'[68]MTS clawback jnl 2'!$A$11:$E$76,5,0))","v":0},{"$f":"IF(ISERROR(VLOOKUP(B12,'[68]LTS-MAT clawback jnl'!$A$11:$F$87,5,0)),0,VLOOKUP(B12,'[68]LTS-MAT clawback jnl'!$A$11:$F$87,5,0))","v":128.46},{"$f":"IF(ISERROR(VLOOKUP(B12,'[68]LTS-MAT clawback jnl 2'!$A$11:$F$87,5,0)),0,VLOOKUP(B12,'[68]LTS-MAT clawback jnl 2'!$A$11:$F$87,5,0))","v":28.88},12798.380000000001,null,null,{"$f":"V16","v":0}]
["Beis Yaakov",10128,null,null,null,null,null,null,null,null,null,null,null,null,{"$f":"IF(ISERROR(VLOOKUP(B13,'[68]MTS clawback jnl'!$A$11:$E$76,5,0)),0,VLOOKUP(B13,'[68]MTS clawback jnl'!$A$11:$E$76,5,0))","v":867.93},{"$f":"IF(ISERROR(VLOOKUP(B13,'[68]MTS clawback jnl 2'!$A$11:$E$76,5,0)),0,VLOOKUP(B13,'[68]MTS clawback jnl 2'!$A$11:$E$76,5,0))","v":21.16},{"$f":"IF(ISERROR(VLOOKUP(B13,'[68]LTS-MAT clawback jnl'!$A$11:$F$87,5,0)),0,VLOOKUP(B13,'[68]LTS-MAT clawback jnl'!$A$11:$F$87,5,0))","v":76.44},{"$f":"IF(ISERROR(VLOOKUP(B13,'[68]LTS-MAT clawback jnl 2'!$A$11:$F$87,5,0)),0,VLOOKUP(B13,'[68]LTS-MAT clawback jnl 2'!$A$11:$F$87,5,0))","v":17.18},-982.70999999999992]
["Beit Shvidler",11278,null,null,null,null,null,null,null,null,null,null,null,null,{"$f":"IF(ISERROR(VLOOKUP(B14,'[68]MTS clawback jnl'!$A$11:$E$76,5,0)),0,VLOOKUP(B14,'[68]MTS clawback jnl'!$A$11:$E$76,5,0))","v":0},{"$f":"IF(ISERROR(VLOOKUP(B14,'[68]MTS clawback jnl 2'!$A$11:$E$76,5,0)),0,VLOOKUP(B14,'[68]MTS clawback jnl 2'!$A$11:$E$76,5,0))","v":0},{"$f":"IF(ISERROR(VLOOKUP(B14,'[68]LTS-MAT clawback jnl'!$A$11:$F$87,5,0)),0,VLOOKUP(B14,'[68]LTS-MAT clawback jnl'!$A$11:$F$87,5,0))","v":0},{"$f":"IF(ISERROR(VLOOKUP(B14,'[68]LTS-MAT clawback jnl 2'!$A$11:$F$87,5,0)),0,VLOOKUP(B14,'[68]LTS-MAT clawback jnl 2'!$A$11:$F$87,5,0))","v":0},0,null,null,null,"Barnfield",10044]
["Bell Lane",10045,null,3646.72,3646.72,null,null,null,null,null,null,null,null,3646.72,{"$f":"IF(ISERROR(VLOOKUP(B15,'[68]MTS clawback jnl'!$A$11:$E$76,5,0)),0,VLOOKUP(B15,'[68]MTS clawback jnl'!$A$11:$E$76,5,0))","v":0},{"$f":"IF(ISERROR(VLOOKUP(B15,'[68]MTS clawback jnl 2'!$A$11:$E$76,5,0)),0,VLOOKUP(B15,'[68]MTS clawback jnl 2'!$A$11:$E$76,5,0))","v":0},{"$f":"IF(ISERROR(VLOOKUP(B15,'[68]LTS-MAT clawback jnl'!$A$11:$F$87,5,0)),0,VLOOKUP(B15,'[68]LTS-MAT clawback jnl'!$A$11:$F$87,5,0))","v":95.72},{"$f":"IF(ISERROR(VLOOKUP(B15,'[68]LTS-MAT clawback jnl 2'!$A$11:$F$87,5,0)),0,VLOOKUP(B15,'[68]LTS-MAT clawback jnl 2'!$A$11:$F$87,5,0))","v":21.52},3529.48,null,null,null,"Bell Lane",10045]
{"$rows_left_out":86}
{"sheet":"Sept 2017","index":9,"n_rows":277,"n_cols":12,"rows_kept":277,"cut":false,"hidden":false,"merged":[]}
[null,null,"Standard School List as at September 2017"]
["category","type","School","Option","Cost Centre","DfE NO.","Cash at Bank GL","Vendor No.","Customer No."]
[]
["Nur","Comm","Brookhill Nursery","A",10130,1000,{"$f":"VLOOKUP(E4,'[69]bank code'!$B$4:$D$99,2,0)","v":938600},400102,"10021968"]
["Nur / CC","Comm","Hampden Way Nursery","A",10131,1001,{"$f":"VLOOKUP(E5,'[69]bank code'!$B$4:$D$99,2,0)","v":938601},400103,"10028845"]
["Nur","Comm","Moss Hall Nursery","A",10132,1002,{"$f":"VLOOKUP(E6,'[69]bank code'!$B$4:$D$99,2,0)","v":938602},400072,"10006116"]
["Nur / CC","Comm","St Margaret's Nursery","A",10133,1003,{"$f":"VLOOKUP(E7,'[69]bank code'!$B$4:$D$99,2,0)","v":938603},400104,"10010756"]
[null,null,"Total Nursery Schools",null,null,null,null,null,null,{"$f":"COUNTA(E4:E7)","v":4}]
["Pri","VA","Akiva","C",11094,3520,{"$f":"VLOOKUP(E9,'[69]bank code'!$B$4:$D$99,2,0)","v":938701},400125,"10030154"]
["Pri","VA","All Saints' CE (N20)","A",10042,3317,{"$f":"VLOOKUP(E10,'[69]bank code'!$B$4:$D$99,2,0)","v":938664},400015,"10006041"]
["Pri","VA","All Saints' CE (NW2)","A",10040,3300,{"$f":"VLOOKUP(E11,'[69]bank code'!$B$4:$D$99,2,0)","v":938652},400069,"10006117"]
["Pri","VA","Annunciation RC Infant ","A",10043,3500,{"$f":"VLOOKUP(E12,'[69]bank code'!$B$4:$D$99,2,0)","v":938665},400023,"10008146"]
["Pri","VA","Annunciation RC Junior ","A",10117,3514,{"$f":"VLOOKUP(E13,'[69]bank code'!$B$4:$D$99,2,0)","v":938677},400107,"10007147"]
["Pri / CC","Comm","Barnfield","D",10044,2002,{"$f":"VLOOKUP(E14,'[69]bank code'!$B$4:$D$99,2,0)","v":938605},400005,"10007053"]
["Pri","VA","Beis Yaakov","A",10128,2079,{"$f":"VLOOKUP(E15,'[69]bank code'!$B$4:$D$99,2,0)","v":938651},400070,"10028579"]
{"$rows_left_out":262}